PARSEC-3.0编译错误
OS: Ubuntu 14.04 LTS (x86_64)
***error 1 OpenSSL 1.0.1e 与 perl5.18 不兼容
POD document had syntax errors at /usr/bin/pod2man line 71.
make[1]: *** [install_docs] Error 255
修改
1降低perl 版本,perl-5.14.2和perl-5.16.3可行
可以利用perlbrew工具安装多个perl版本,参考http://www.cnblogs.com/aaron2015/p/5132308.html
apt-get install perlbrew
perlbrew install perl-5.14.
perlbrew use perl-5.14.
2删除 pod2man文件
sudo rm /usr/bin/pod2man
***error 2 __mbstate_t 重复定义
/usr/include/wchar.h:: error: conflicting types for ‘__mbstate_t’
../include/sys/bsd__types.h:: note: previous declaration of ‘__mbstate_t’ was here
make[]: *** [if_host.o] Error
修改
vim /parsec-3.0/pkgs/libs/uptcpip/src/include/sys/bsd__types.h
将 __mbstate_t 定义注释掉(在102-105行)
***error 3 tbb/task_scheduler_init.h: No such file or directory
[PARSEC] Error: 'env version=tbb /usr/bin/make' failed.
If you see the above error message, type the following to install some packages:
sudo apt-get install -y libtbb2 tbb-examples
PARSEC-3.0编译错误的更多相关文章
- faster-rcnn CUDA8.0编译错误
之前编译Faster-RCNN的时候用的都是CUDA7.5,最近换了机器,变成了CUDA8.0,果然编译出现错误了…… 参考下面这篇博客解决了问题: http://blog.csdn.net/kexi ...
- qt5.4.0编译错误
error1: 进程"C:\Qt\Qt5.4.0\Tools\QtCreator\bin\jom.exe"退出,退出代码 2 solution:去工具->选项->构建和 ...
- 处理编译错误"0" is an invalid value for the "DebugInformation" parameter of the "DCC"
在编译“MustangpeakCommonLib-master.zip”时,遇到了这个问题.网上搜了一下: 处理编译错误"0" is an invalid value for the "DebugIn ...
- Thrift-0.10.0 CenOS 7 编译错误 error: expected ')' before 'PRIu32'
Thrift-0.10.0 CenOS 7 编译错误 error: expected ')' before 'PRIu32' 在编译Thrift的时候,无论是Apache官网tar包,还是Github ...
- 处理编译错误"0" is an invalid value for the "DebugInformation" parameter of the "DCC" task.
在安装一个从XE6复制到XE4的控件时出现编译错误: [MSBuild Error] "0" is an invalid value for the "DebugInfo ...
- Eclipse Xml编译错误Referenced file contains errors - spring-beans-4.0.xsd
本文转自:http://josh-persistence.iteye.com/blog/2125420 在eclipse中,有时候在xml文件中,特别是于Spring相关的配置文件中,会出现一些不影响 ...
- delphi vlc 安装bug 处理编译错误"0" is an invalid value for the "DebugInformation" parameter of the "DCC"
处理编译错误"0" is an invalid value for the "DebugInformation" parameter of the "DCC" [摘要:http://blog.csdn ...
- xamarin.forms新建项目android编译错误
vs2015 update3 新建的xamarin.forms项目中的android项目编译错误.提示缺少android_m2repository_r22.zip,96659D653BDE0FAEDB ...
- VS2010出现FileTracker : error FTK1011编译错误的解决办法
VS2010出现FileTracker : error FTK1011不知道是不是vs2010的一个bug,反正有人提交了. FileTracker : error FTK1011编译错误的解决办法有 ...
随机推荐
- Struts2_三种传参数方法
1.通过属性传参数(Attr)UserAction.java package com.bebig.struts2.user.action;import com.opensymphony.xwork2. ...
- hdoj 5074
Problem Description Hatsune Miku is a popular virtual singer. It is very popular in both Japan and C ...
- Office 365 SharePoint 使用Charts Web Part
如果你在web part->业务数据下找不到Charts Web Part 可以修改你的URL https://goitmch.sharepoint.com/sites/xxxx/_layout ...
- sql之多表连接
最近遇到特别多多表连接的问题,因此随笔记下,开始学java和mysql的时间太短,有见解不周的地方,希望读者可以提出探讨. 对于left join.right join和inner join(join ...
- Javascript练习
1.时钟 <!DOCTYPE html> <html> <head> <meta charset="UTF-8"> <titl ...
- Coding源码学习第四部分(Masonry介绍与使用(三))
接上篇继续进行Masonry 的学习. (12)tableViewCell 布局 #import "TableViewController.h" #import "Tes ...
- webstorm 10 更改默认端口
快捷键 ctrl + Alt + s :打开配置 如图下可以更改 默认端口.快捷键可能跟qq的快捷键冲突,可以关闭qq来设置端口
- Python的平凡之路(15)
一.CSS补充: 1. 上节课讲述 a.css重用 <style> 如果整个页面的宽度 > 900px时: { ...
- SparkMLlib之 logistic regression源码分析
最近在研究机器学习,使用的工具是spark,本文是针对spar最新的源码Spark1.6.0的MLlib中的logistic regression, linear regression进行源码分析,其 ...
- adb catlog>d:\log.txt日志级别
W,警告 I,通知 D,调试 E,错误 V, 到最细的日志 功能测试可以看W和E,性能测试I比较有用