_client.DownloadDataAsync(new Uri(url));
_client.DownloadDataCompleted += (sender, e) =>
{
try
{
if (e.Result != null && e.Result.Length > 0 && e.Error == null && e.Cancelled == false)
using (FileStream fileStream = new FileStream(path + file_name, FileMode.Create))
fileStream.Write(e.Result, 0, e.Result.Length);
}
catch (Exception ex)
{
OpenOperator.Error(string.Format("列表页生成任务异常,url:{0}", url), ex);
}
};

大规模download会涉及到站点并发问题,请参见:

.Net魔法堂:开启IIS的WebGarden、WebFarm和StateServer之旅

How to avoid the 0-byte file on Webclient download error的更多相关文章

  1. D:\Software\Keil5\ARM\PACK\Keil\STM32F1xx_DFP\2.1.0\Device\Include\stm32f10x.h(483): error: #5: cannot open source input file "core_cm3.h": No such file or directory

    1. 错误提示信息: D:\Software\Keil5\ARM\PACK\Keil\STM32F1xx_DFP\2.1.0\Device\Include\stm32f10x.h(483): erro ...

  2. Unable to open the physical file xxxx. Operating system error 2

    在新UAT服务器上,需要将tempdb放置在SSD(固态硬盘)上.由于SSD(固态硬盘)特性,所以tempdb的文件只能放置在D盘下面,而不能是D盘下的某一个目录下面. ALTER  DATABASE ...

  3. CREATE FILE encountered operating system error 5(Access is denied.)

    这篇博文主要演示"CREATE FILE encountered operating system error 5(Access is denied.)"错误如出现的原因(当然只是 ...

  4. 编译gcc报错make[3]: Leaving directory `/usr/local/src/gcc-7.4.0/build/gcc' make[2]: *** [all-stage1-gcc] Error 2 处理

    因业务需要安装7.4高版本gcc时报错: configure: error: in `/usr/local/src/gcc-7.4.0/build/gcc': configure: error: C+ ...

  5. ADS报错 Warning : L6301W:Could not find file C:\Program Files . Error : L6218 : Undefined symbol ......

    ADS1.2编译时,出现找不到一个不存在目录下的目标文件(*.o) 编译一个COPY到硬盘上的一个工程,出现以下的fatal error message: Error: (Fatal)L6002: C ...

  6. windows redis 连接错误Creating Server TCP listening socket 127.0.0.1:637 9: bind: No error

    报错信息如下: [10036] 30 Dec 10:23:49.616 # Creating Server TCP listening socket 127.0.0.1:637 9: bind: No ...

  7. CMake error:System Error:No such file or directory CMake error:Could not open file for write in copy operation xxxx.ros_Config.cmake.tmp.

    微型电脑或嵌入式与电脑还是有点不同的,在微型电脑上ros indigo 版本下利用catkin编译如果你遇到如下错误: CMake error:System Error:No such file or ...

  8. vue报错之Duplicate keys detected: '0'. This may cause an update error.

    昨天运行vue项目的时候,出现了[Vue warn]: Duplicate keys detected: '0'. This may cause an update error(错误,检测到重复的ke ...

  9. Fortify漏洞之Portability Flaw: File Separator 和 Poor Error Handling: Return Inside Finally

    继续对Fortify的漏洞进行总结,本篇主要针对 Portability Flaw: File Separator 和  Poor Error Handling: Return Inside Fina ...

随机推荐

  1. supervisor管理php-fpm

    /etc/php-fpm.conf,设置daemonize = no,默认是yes

  2. Jenkins插件安装

    默认的Jenkins平台继有的功能是有限的,插件为Jenkins提供了各种扩展功能,有了插件,Jenkins就会变得更加强大,这里推荐两个不错的插件: 点击菜单栏中“系统管理”--“插件管理”--“A ...

  3. [LeetCode] 5. 最长回文子串

    题目链接:https://leetcode-cn.com/problems/longest-palindromic-substring/ 题目描述: 给定一个字符串 s,找到 s 中最长的回文子串.你 ...

  4. 网易云歌词解析(配合audio标签实现本地歌曲播放,歌词同步)

    先看下效果 github上做的一个音乐播放器: https://github.com/SorrowX/electron-music 中文歌曲 英文歌曲(如果有翻译的中文给回返回出去) 韩文歌曲 来看下 ...

  5. 阿里面试题BIO和NIO数量问题附答案和代码

    一.问题 BIO 和 NIO 作为 Server 端,当建立了 10 个连接时,分别产生多少个线程? 答案: 因为传统的 IO 也就是 BIO 是同步线程堵塞的,所以每个连接都要分配一个专用线程来处理 ...

  6. 解决import模块后提示无此模块的问题

    最近在工作中发现一个奇怪的问题: 明明已经装上了,但是还提示找不到该模块,没办法,我又去site-package文件下面看了: 发现Linux下自带的python2.7里面装上了该模块(我在root用 ...

  7. mac用BootCamp装windows装完之后驱动问题

    刚装完会有一个临时盘里面找到BootCamp文件夹然后运行setup.exe,装完即可.

  8. vue mock自己总结

    cli安装mock模块 npm   install  mockjs 创建mock文件夹 配置及创建文件 当后端写好真实接口以后,我们只需删掉创建的mock.js文件和在main.js中导入假数据的那行 ...

  9. VMware Workstation 10序列号:

    VMware Workstation 10序列号:1Y0LW-4WJ9N-LZ5G9-Z81QP-92PN7

  10. 安装mysql8.0出现服务无法启动,服务没报告任何错误

    改为net start mysql80 参考https://blog.csdn.net/gzejia/article/details/82156994