报错:Heartbeating to master:7182 failed.
报错背景:
cloudera-scm-agent 可以启动并且存活,但是jps没有进程。
报错现象:
查看报错日志:/opt/cm-5.15.1/log/cloudera-scm-agent/cloudera-scm-agent.log

[/Apr/ :: +] MainThread throttling_logger INFO ( skipped) Identified java component java8 with full version java version "1.8.0_191" Java(TM) SE Runtime Environment (build 1.8.0_191-b12) Java HotSpot(TM) -Bit Server VM (build 25.191-b12, mixed mode) for requested version .
[/Apr/ :: +] MainThread agent ERROR Heartbeating to master: failed.
Traceback (most recent call last):
File "/opt/cm-5.15.1/lib64/cmf/agent/build/env/lib/python2.7/site-packages/cmf-5.15.1-py2.7.egg/cmf/agent.py", line , in _send_heartbeat
response = self.requestor.request('heartbeat', heartbeat_data)
File "/opt/cm-5.15.1/lib64/cmf/agent/build/env/lib/python2.7/site-packages/avro-1.6.3-py2.7.egg/avro/ipc.py", line , in request
return self.issue_request(call_request, message_name, request_datum)
File "/opt/cm-5.15.1/lib64/cmf/agent/build/env/lib/python2.7/site-packages/avro-1.6.3-py2.7.egg/avro/ipc.py", line , in issue_request
call_response = self.transceiver.transceive(call_request)
File "/opt/cm-5.15.1/lib64/cmf/agent/build/env/lib/python2.7/site-packages/avro-1.6.3-py2.7.egg/avro/ipc.py", line , in transceive
result = self.read_framed_message()
File "/opt/cm-5.15.1/lib64/cmf/agent/build/env/lib/python2.7/site-packages/avro-1.6.3-py2.7.egg/avro/ipc.py", line , in read_framed_message
response = self.conn.getresponse()
File "/usr/lib64/python2.7/httplib.py", line , in getresponse
response.begin()
File "/usr/lib64/python2.7/httplib.py", line , in begin
version, status, reason = self._read_status()
File "/usr/lib64/python2.7/httplib.py", line , in _read_status
raise BadStatusLine(line)
BadStatusLine: ''
[/Apr/ :: +] MainThread agent ERROR Heartbeating to master: failed.
Traceback (most recent call last):
File "/opt/cm-5.15.1/lib64/cmf/agent/build/env/lib/python2.7/site-packages/cmf-5.15.1-py2.7.egg/cmf/agent.py", line , in _send_heartbeat
self.master_port)
File "/opt/cm-5.15.1/lib64/cmf/agent/build/env/lib/python2.7/site-packages/avro-1.6.3-py2.7.egg/avro/ipc.py", line , in __init__
self.conn.connect()
File "/usr/lib64/python2.7/httplib.py", line , in connect
self.timeout, self.source_address)
File "/usr/lib64/python2.7/socket.py", line , in create_connection
raise err
error: [Errno ] Connection refused
[/Apr/ :: +] MainThread agent INFO Stopping agent...
报错日志
报错原因:
报错信息:ERROR Heartbeating to master:7182 failed。
错误解释:向master节点的指定端口7180发送心跳检测失败。
首次启动Agent,它会生成一个uuid,路径为:/opt/cm-5.1.3/lib/cloudera-scm-agent/uuid,如果每台机器上的Agent的uuid都是一样,就会出现报错情况。
报错解决:
进入目录:cd /opt/cm-5.15.1/lib/cloudera-scm-agent/
删除uuid:rm -rf uuid
重启agent:/opt/cm-5.15.1/etc/init.d/cloudera-scm-agent restart
报错:Heartbeating to master:7182 failed.的更多相关文章
- Win7 64bit 安装VisualSVN出现报错:Servic 'VisualSVN Server' failed to start.解决办法
问题描述: Win7 64bit 安装VisualSVN时出现报错: Servic 'VisualSVN Server' failed to start.Please check VisualSVN ...
- pandas.read_csv() 报错 OSError: Initializing from file failed,报错原因分析和解决方法
今天调用pandas读取csv文件时,突然报错“ OSError: Initializing from file failed ”,我是有点奇怪的,以前用的好好的,read_csv(path)方法不是 ...
- [Error]Python虚拟环境报错 OSError: setuptools pip wheel failed with error code 2
mkvirtualenv py35 python新建虚拟环境报错,setuptools pip wheel failed with error code 2 刚好昨天在CentOS安装的时候也总是报s ...
- 关于163发邮件报错535 Error:authentication failed解决方法
关于发邮件报错535 Error:authentication failed解决方法 调用163邮箱服务器来发送邮件,我们需要开启POP3/SMTP服务,这时163邮件会让我们设置客户端授权码,这个授 ...
- 【Elasticsearch】ES中时间查询报错:Caused by: ElasticsearchParseException[failed to parse date field [Sun Dec 31 16:00:00 UTC 2017] with format [yyyy-MM-dd HH:mm:ss||yyyy-MM-dd||epoch_millis]];
ES中时间查询报错:Caused by: ElasticsearchParseException[failed to parse date field [Sun Dec 31 16:00:00 UTC ...
- zabbix启动报错:Connection to database 'xxx' failed解决方法
Zabbix 分布式系统监视系统 zabbix是一个基于WEB界面的提供分布式系统监视以及网络监视功能的企业级的开源解决方案. zabbix能监视各种网络参数,保证服务器系统的安全运营:并提供灵活的通 ...
- 我的Android进阶之旅------>Android中MediaRecorder.stop()报错 java.lang.RuntimeException: stop failed.【转】
本文转载自:http://blog.csdn.net/ouyang_peng/article/details/48048975 今天在调用MediaRecorder.stop(),报错了,java.l ...
- Hive 报错 Error while compiling statement: FAILED: ParseException line 1:0 character '' not supported here (state=42000,code=40000)
Hive报错 Error while compiling statement: FAILED: ParseException line 1:0 character '' not supported h ...
- tomcat 启动报错org.apache.catalina.LifecycleException: Failed to start component [StandardEngine[Catalina].StandardHost[localhost].xxx
今天在写完一个非常简单的servlet页面跳转的web项目后,启动tomcat报错org.apache.catalina.LifecycleException: Failed to start com ...
随机推荐
- SDN 软件定义网络----学习1
原文地址https://www.infoq.cn/article/sdn-and-cloud-network 1.1,什么是 SDN? 什么是 SDN?SDN 的官方解释上提出了 SDN 的三个特性: ...
- 城市扩张实验---ARCGIS处理踩雷
1. 将每个坐标点按照所属泰森多边形分类后,得到了数据统计表,导出到excel里面数据透析. 数据透析行代表泰森多边形编号,列代表地物类别,求和项是frequency.一开始的求和不会显示求和,,而是 ...
- MYSQL列表中常用语句代码块
查看数据表是否存在:SHOW TABLES; 显示已经打开的数据库:SELECT DATABASE(); 查看数据表结构:SHOW COLUMNS FROM ***(数据表名): 插入数据:INSER ...
- 以太坊上发行ERC20代币
ERC20 代币生成 环境 虚拟主机: ubuntu 18虚拟机 宿主主机: win10; ip:192.168.0.160 1.部署以太坊 1.1 安装GO 安装go,并编译geth 将下载好的go ...
- python初识模块
sys import sys print(sys.argv) #输出 $ python test.py helo world ['test.py', 'helo', 'world'] # ...
- spring boot 单元测试
Java新手 纯记录 @RunWith(SpringJUnit4ClassRunner.class) @SpringBootTest(classes = OutDemoApplication.clas ...
- 使用min-device-pixel-ratio媒体功能实现真正的1像素border
关于设备像素比的知识,想必做过移动端开发的都有接触,这里就不介绍啦,万一有不懂的可以看张鑫旭大神的设备像素比devicePixelRatio简单介绍 由于设备像素比存在的原因,我们在处理设计图的一些边 ...
- vue中使用video插件vue-video-player
一.安装插件 npm install vue-video-player --save 二.配置插件 在main.js中全局配置插件 import VideoPlayer from 'vue-video ...
- Python:从入门到实践--第九章-类--练习
#.餐馆:创建一个名为Restaurant的类,其方法_init_()设置两个属性:restaurant_name和cuisine_type. #创建一个名为describe_restaurant的方 ...
- 最基础的 swift 语言
import Foundation //打印函数 print("Hello, World!") //不用加分号, 字符串就是"", 不用加@ print(&qu ...