maven打包工程出现错误 Failed to execute goal org.apache.maven.plugins:maven-surefire-plugin:2.12.4:test
今天用maven在命令行打包项目的时候出现错误:
Failed to execute goal org.apache.maven.plugins:maven-surefire-plugin:2.12.4:test (default-test) on project xxx: There are test failures.
但是项目用maven编译没问题,之前测试也都过了。从上面描述可以确定是单元测试部分有问题,然后仔细研究了错误内容,发现是因为我定义了一个测试基类,里面没有任何测试方法,抛出了java.lang.Exception: No runnable methods。
解决办法:增加一个@Ignore,表示打包的时候忽略这个测试类,就能成功了。
转载:迷茫的叶
maven打包工程出现错误 Failed to execute goal org.apache.maven.plugins:maven-surefire-plugin:2.12.4:test的更多相关文章
- [转]maven打包报错:Failed to execute goal org.apache.maven.plugins:maven-surefire-plugin:2.5:test
源文URL:http://blog.csdn.net/caiwenfeng_for_23/article/details/44514947 mvn compile 没有问题,mvn package的 ...
- maven打包报错:Failed to execute goal org.apache.maven.plugins:maven-surefire-plugin:2.5:test
mvn package的时候报如下错误: Failed to execute goal org.apache.maven.plugins:maven-surefire-plugin:2.5:test ...
- 打包遇到错误Failed to execute goal org.apache.maven.plugins:maven-surefire-plugin:2.22.2:test
引自:https://blog.csdn.net/xiexiangyan/article/details/107936774 遇到的问题 有一个maven项目,我clone一下最新的代码.准备打包(m ...
- 【maven】在IDEA上 使用maven进行打包时报错:Failed to execute goal org.apache.maven.plugins:maven-javadoc-plugin:2.10.3:jar
报错内容如下: [INFO] ------------------------------------------------------------------------ [INFO] BUILD ...
- Maven错误“Failed to execute goal org.apache.maven.plugins:maven-archetype-plugin:2.4:create ”解决
用maven3新建一个项目时,输入的命令如下: mvn archetype:create 出现错误如下: [ERROR] Failed to execute goal org.apache.maven ...
- 解决maven项目 maven install失败 错误 Failed to execute goal org.apache.maven.plugins
1.Maven构建失败 Failed to execute goal org.apache.maven.plugins:maven-compiler-plugin: 2.3.4 :compile ( ...
- 解决maven install报错信息(Failed to execute goal org.apache.maven.plugins:maven-compiler-plugin:3.1:compile )
Maven install失败 Failed to execute goal org.apache.maven.plugins:maven-compiler-plugin:3.1:compile (d ...
- Maven项目报错:Failed to execute goal org.apache.maven.plugins:maven-clean-plugin:2.5:clean (default-clea
[ERROR] Failed to execute goal org.apache.maven.plugins:maven-clean-plugin:2.5:clean (default-clean) ...
- Maven 打包的时候报 Failed to execute goal org.codehaus.mojo:native2ascii-maven-plugin
错误信息: [ERROR] Failed to execute goal org.codehaus.mojo:native2ascii-maven-plugin:1.0-alpha-1:native2 ...
随机推荐
- BZOJ2152 聪聪可可 (点分治)
2152: 聪聪可可 题意: 在一棵边带权的树中,问任取两个点,这两个点间的权值和是3的倍数的概率. 思路: 经典的点分治题目. 利用点分治在计算所有路径长度,把路径长度对3取模,用t[0],t[1] ...
- LuoGu-P1122 最大子树和+树形dp入门
传送门 题意:在一个树上,每个加点都有一个值,求最大的子树和. 思路:据说是树形dp入门. 用dfs,跑一边,回溯的时候求和,若和为负数,则减掉,下次不记录这个节点. #include <ios ...
- 牛客19985 HAOI2011向量(裴属定理,gcd)
https://ac.nowcoder.com/acm/problem/19985 看到标签“裴属定理”就来做下,很眼熟,好像小学奥数学过.. 题意:给你a,b,x,y,你可以任意使用(a,b), ( ...
- c语言实现数组的排序
本文章只对选择排序和冒泡排序进行介绍 选择排序实际上是从0到length-1,选择某个元素与其他的元素进行大小比较,如果大于就交换,其他情况不做操作,如图: 冒泡排序实际上是先选择某个元素,然后从 ...
- SpringBoot应用启动过程分析
真的好奇害死猫!之前写过几个SpringBoot应用,但是一直没搞明白应用到底是怎么启动的,心里一直有点膈应.好吧,趁有空去看了下源码,写下这篇博客作为学习记录吧! 个人拙见,若哪里有理解不对的地方, ...
- Maven生成项目站点
概述 Maven不仅仅是一个自动化构建工具和一个依赖工具,还能够帮助聚合项目信息.POM可以包含各种项目信息.如项目描述.版本控制系统地址.缺陷跟踪系统地址.许可证信息.开发者信息等. 另Maven社 ...
- Maven学习归纳(三)——依赖添加依赖排除与项目整合
一.Maven的坐标 1. 坐标的定义 数学意义上的坐标可以是平面上的(x,y)也可以是空间上的(x,y,z),都可以确定一个质点的位置和方向. Maven中有很多构件,为了能够自动化解析任何一个构件 ...
- scrapy-redis分布式爬取猫眼电影
能够利用redis缓存数据库的优点去重来避免数据的大面积冗余 1.首先就是要创建猫眼爬虫项目 2.进入项目内部创建一个爬虫文件 创建完文件之后就是要爬取的内容,我这边以爬取猫眼电影的title和lin ...
- 松软科技课堂:Winform之TextBox
松软科技文(www.sysoft.net.cn): 文本框的几种模式:Multiline(多行).PasswordChar(密码)将文本框的PasswordChar设为*就是密码框效果,将MultiL ...
- charles 启用/禁用断点
本文参考:charles 启用/禁用断点 1.3. enable/disable breakpoints 和 2.3 breakpoints settings 断点设置是常用的了,没啥好说的了,可以设 ...