改问题是"babel-eslint"版本更新问题导致的;

给大家一个最简单粗暴的解决方案:

在项目里找到对应的工程:直接删除里面的node_modules文件夹,然后重新npm install下就可以了;

node_modules文件内容较多,建议用cnpm install,会更快一点。

重新install后能正常跑起来了.
 
tips:
当清node_modules 出现某一些包错误时候,查不到原因时候,可以先清除缓存试试。
rm -rf node_modules
npm cache clean
npm install

npm cache clean // 暴力清缓存:npm cache clean --force

 
 

vue工程npm run serve/start/dev启动时,node_modules文件报:Cannot read property 'range' of null 错误的更多相关文章

  1. VUE npm run dev 启动时,报了一大堆错误 Node Sass could not find a binding for your current environment: Windows 64-bit with Node.js 7.x

    npm run dev 启动时,报了一大堆错误 Module build failed: Error: Missing binding E:\2017VocaSchool\vocationWeb\no ...

  2. npm run dev 和 npm run serve

    1.ERR引发的思考 创建好的 vue 项目直接执行 vue run dev 报错?运行 vue run serve 就可以启动...如下 npm run dev npm ERR! missing s ...

  3. vue中npm run dev运行项目不能自动打开浏览器! 以及 webstorm跑vue项目jshint一直提示错误问题的解决方法!

    vue中npm run dev运行项目不能自动打开浏览器!以及 webstorm跑vue项目jshint一直提示错误问题的解决方法! 1.上个项目结束就很久没有使用vue了,最近打算用vue搭建自己的 ...

  4. vue项目npm run dev 报错error in ./src/main.js Module build failed: Error: Cannot find module 'babel-plugin-syntax-jsx'

    问题: vue 项目npm run dev运行时报错,如下图:  原因: 缺少相应的组件 解决办法: 安装相应组件: npm install babel-plugin-syntax-jsx --sav ...

  5. vue项目npm run dev 报错error in ./src/main.js Module build failed: ReferenceError: Unknown plugin "transform-vue-jsx" specified in......

    问题: vue项目npm run dev运行时报错,如下图:  原因: 缺少组件 解决办法: 安装相应的组件:  npm install babel-plugin-transform-vue-jsx ...

  6. 在终端输入npm run serve时出现npm ERR! code ELIFECYCLE npm ERR! errno 1 npm ERR! test_vue_0613@1.0.0 dev: 错误的解决方法

    在vscode终端使用命令 npm run serve 的时候报错 错误原因在于由于文件 node_modules 太大,在项目上传时有些人会删掉 导致我们下载的项目中缺少这个文件 在尝试把自己项目的 ...

  7. vue使用npm run build命令打包

    vue使用npm run build命令打包项目   当我们使用vue-cli脚手架完成一个项目的时候,下一步肯定会想要怎么把这个项目放到互联网上或者本地直接打开呢,我们在本地调试的时候只要命令行执行 ...

  8. Vue -- vue-cli(vue脚手架) npm run build打包优化

    这段时间公司新项目立项,开发组选用 Vue2.0 进行开发.当然也就一并用到 vue cli 进行自动化构建.结果在基础版本开发完成后,用 npm run build 命令打包上线时,发现以下几个问题 ...

  9. 连接远程MySQL数据库项目启动时,不报错但是卡住不继续启动的,

    连接远程MySQL数据库项目启动时,不报错但是卡住不继续启动的, 2018-03-12 17:08:52.532DEBUG[localhost-startStop-1]o.s.beans.factor ...

随机推荐

  1. Linux学习笔记(四) vi编辑器

    一.vi 编辑器 vi 编辑器 (Visual Interface) 是所有 Unix 及 Linux 系统下标准的编辑器,相当于 Windows 系统中的记事本 它有三种模式,分别是: Comman ...

  2. python3 时间模块 random模块之两个小练习

    话不多说,一个是算时间的,还有一个是生成验证码的 #!usr/bin/env/ python # -*- coding:utf-8 -*- # Author: XiaoFeng import time ...

  3. NT9666X调试log

    1.给GSensor_open();前加上打印函数DEBUG_P;打印如下信息: ######## FILE = e:/Project_code/Philips_PanGu/Philips_PanGu ...

  4. 洛谷 2633 BZOJ 2588 Spoj 10628. Count on a tree

    [题解] 蜜汁强制在线... 每个点开一个从它到根的可持久化权值线段树.查询的时候利用差分的思想在树上左右横跳就好了. #include<cstdio> #include<algor ...

  5. SGU -1500 - Pass Licenses

    先上题目: 1500. Pass Licenses Time limit: 2.5 secondMemory limit: 64 MB A New Russian Kolyan believes th ...

  6. graylog 市场

    https://marketplace.graylog.org/addons/246dc332-7da7-4016-b2f9-b00f722a8e79

  7. [bzoj1878][SDOI2009]HH的项链_莫队

    HH 的项链 bzoj-1878 SDOI-2009 题目大意:给定一个n个数的序列.m次询问,每次询问一段区间内数的种类数. 注释:$1\le n\le 5\cdot 10^4$,$1\le m\l ...

  8. POJ 1475 推箱

    推箱 时限:n.2000MS   内存限制:n.131072K 提交材料共计: 6600   接受: 2263   特别法官 描述 想象一下你站在一个二维迷宫里,由方形细胞组成,它们可能或可能不会充满 ...

  9. - > 贪心基础入门讲解五——任务执行顺序

    分析: 本题可以抽象成,从一个整数开始,每次减去a,再加上b (a,b都是正数),要求每次操作都不产生负数. 针对本题a[i] = R[i], b[i] = R[i] – O[i],注意O[i] &l ...

  10. Ubuntu 16.04安装7zip

    搜索时发现7zip有两个:p7zip,p7zip-full,p7zip-rar.研究发现: p7zip:包含7zr(最小的7zip归档工具),仅仅只能处理原生的7z格式. p7zip-full:包含7 ...