vue启动项目报如下错误:

Failed to compile.

./src/components/Vcontent.vue

Module Error (from ./node_modules/eslint-loader/index.js): E:\myvue\src\components\Vcontent.vue

: error Parsing error: unexpected-character-in-attribute-name vue/no-parsing-error

: error Parsing error: unexpected-character-in-attribute-name vue/no-parsing-error ? problems ( errors, warnings)

当vue渲染html为原生标签时出这个错误,需要修改配置项。

优化如下:

第一步:初始化并重新安装eslint

npm init -y
npm install eslint --save-dev

第二步:cd进入node_modules下的bin目录,并初始化eslint

cd ./node_modules/.bin/
eslint --init

第三步:根据自己项目设置配置选项,除选择vue.js外,其他都选择默认项或者y(如不懂可自行百度)

? How would you like to use ESLint? To check syntax and find problems
? What type of modules does your project use? JavaScript modules (import/export)
? Which framework does your project use? Vue.js

第四步:最重要的一步,将node_modules目录下的bin目录里面的.eslintrc.js文件拷贝到项目根目录下(注意:删除原.eslintrc.js文件)

第五步:重新启动服务:

npm run serve

越努力越幸运!!

Module Error (from ./node_modules/eslint-loader/index.js):解决办法的更多相关文章

  1. 三、npm start报错:./node_modules/history/esm/history.js解决办法

    package.json中的roadhog换为:'^2.5.0-beta.4',删除node_modules文件夹,在执行npm install,npm start.

  2. webpack报错:Module build failed (from ./node_modules/babel-loader/lib/index.js): Error: Cannot find module 'babel-preset-env' from '...' - Did you mean "@babel/env"?

    webpack报错:Module build failed (from ./node_modules/babel-loader/lib/index.js): Error: Cannot find mo ...

  3. webpack命令:Module build failed(from ./node_modules/babel-loader/lib/index.js)/405/错误解决

    在项目中运行的时候出现报错,错误为Module build failed (from ./node_modules/babel-loader/lib/index.js) 解决方案: 控制台输入  np ...

  4. webpack 命令 Module build failed (from ./node_modules/babel-loader/lib/index.js) 错误问题解决方案

    在项目中运行的时候出现报错,错误为Module build failed (from ./node_modules/babel-loader/lib/index.js) 解决方案: 控制台输入  np ...

  5. System Error. Code:1722. RPC服务器不可用解决办法

    原文链接(转载请注明出处):System Error. Code:1722. RPC服务器不可用解决办法 问题 最近在软件设计上机课的时候,使用 starUML 建模工具画UML图的时候总是弹出一条如 ...

  6. node-sass 安装卡在 node scripts/install.js 解决办法

    转自:https://segmentfault.com/a/1190000005921721 ======== 7月12日更新 ======== 总的来说就是两种方法解决: SASS_BINARY_S ...

  7. 【转】linux中执行外部命令提示" error while loading shared libraries"时的解决办法

    今天在Centos下编译kapar 后执行时出错,老说: [root@dc01 ~]# kapar kapar: error while loading shared libraries: libsc ...

  8. linux下解压大于4G文件提示error: Zip file too big错误的解决办法

    error: Zip file too big (greater than 4294959102 bytes)错误解决办法.zip文件夹大于4GB,在centos下无法正常unzip,需要使用第三方工 ...

  9. Visual Studio error C2001:常量中有换行符(解决办法)

    在Visual Studio自动生成的项目中,碰见了一件关于文件编码的问题,集中在类似于以下的语句上: DASLog (DASProtWarn, L"(%s)消息超时,进入慢循环召唤模式.& ...

随机推荐

  1. S32K142学习记录_SDK手动导入

    这几天和一位工程师讨论ADC+PDB学到了很多,当然很多的时候都是我在听, 毕竟新手,顺便其中提出自己的疑问,讨论会让你学到很多 有空会将讨论整理出来 因为demo板还没有到,只能看着大佬的程序对着手 ...

  2. Python中出现 SyntaxError: (unicode error) 'unicodeescape' codec can't decode bytes in position 12-13: truncated \UXXXXXXXX escape

    Python中出现 SyntaxError: (unicode error) 'unicodeescape' codec can't decode bytes in position 12-13: t ...

  3. 获取Class实例的方式与类加载器

    1. java.lang.Class:   是反射的源头 2.如何获取Class的实例(3种) 3.关于类的加载器 TestReflection2 package com.aff.reflection ...

  4. ArrayList及List的常用方法

    ArrayList package com.aff.coll; import java.util.ArrayList; import java.util.List; import org.junit. ...

  5. Rocket - debug - Example: Write Memory

    https://mp.weixin.qq.com/s/on1LugO9fTFJstMes3T2Xg 介绍riscv-debug的使用实例:使用三种方法写内存. 1. Using System Bus ...

  6. 【Linux】yum库的配置

    链接–>CentOS7之yum仓库配置

  7. DOM对HTML元素的增删改操作和事件概念和事件监听

    DOM创建节点的方法: document.createElement(Tag),Tag必须是合法的HTML元素 DOM复制节点的方法: 节点cloneNode(boolean deep),当deep为 ...

  8. DOM表单,下拉菜单和表格

    DOM访问表单控件的常用属性和方法如下: action 返回该表单的提交地址 elements 返回表单内全部表单控件所组成的数组,通过数组可以访问表单内的任何表单控件. length 返回表单内表单 ...

  9. Java实现 蓝桥杯 算法训练 Torry的困惑(基本型)

    算法训练 Torry的困惑(基本型) 时间限制:1.0s 内存限制:512.0MB 问题描述 Torry从小喜爱数学.一天,老师告诉他,像2.3.5.7--这样的数叫做质数.Torry突然想到一个问题 ...

  10. Java实现 蓝桥杯VIP 算法训练 阿尔法乘积

    蓝桥杯–阿尔法乘积 问题描述 计算一个整数的阿尔法乘积.对于一个整数x来说,它的阿尔法乘积是这样来计算的:如果x是一个个位数,那么它的阿尔法乘积就是它本身:否则的话,x的阿尔法乘积就等于它的各位非0的 ...