安装Phoenix时./sqlline.py执行报错File "./sqlline.py", line 27, in <module> import argparse ImportError: No module named argparse解决办法(图文详解)
不多说,直接上干货!
前期博客
Apache版Phoenix的安装(图文详解)
问题现象

Traceback (most recent call last):
File "./sqlline.py", line , in <module>
import argparse
ImportError: No module named argparse
解决办法


[root@master phoenix]# yum install python-argparse
Loaded plugins: fastestmirror, refresh-packagekit, security
Loading mirror speeds from cached hostfile
* base: mirrors..com
* extras: mirrors..com
* updates: mirrors..com
Setting up Install Process
Resolving Dependencies
--> Running transaction check
---> Package python-argparse.noarch :1.2.-2.1.el6 will be installed
--> Finished Dependency Resolution Dependencies Resolved ===============================================================================================================================================================================================
Package Arch Version Repository Size
===============================================================================================================================================================================================
Installing:
python-argparse noarch 1.2.-2.1.el6 base k Transaction Summary
===============================================================================================================================================================================================
Install Package(s) Total download size: k
Installed size: k
Is this ok [y/N]: y
Downloading Packages:
python-argparse-1.2.-2.1.el6.noarch.rpm | kB :
Running rpm_check_debug
Running Transaction Test
Transaction Test Succeeded
Running Transaction
Installing : python-argparse-1.2.-2.1.el6.noarch /
Verifying : python-argparse-1.2.-2.1.el6.noarch / Installed:
python-argparse.noarch :1.2.-2.1.el6 Complete!
[root@master phoenix]#
然后,再重启HBase集群。




[hadoop@master apache-phoenix-4.8.-HBase-0.98-bin]$ bin/sqlline.py master
Setting property: [incremental, false]
Setting property: [isolation, TRANSACTION_READ_COMMITTED]
issuing: !connect jdbc:phoenix:master none none org.apache.phoenix.jdbc.PhoenixDriver
Connecting to jdbc:phoenix:master
SLF4J: Class path contains multiple SLF4J bindings.
SLF4J: Found binding in [jar:file:/home/hadoop/app/apache-phoenix-4.8.-HBase-0.98-bin/phoenix-4.8.-HBase-0.98-client.jar!/org/slf4j/impl/StaticLoggerBinder.class]
SLF4J: Found binding in [jar:file:/home/hadoop/app/hadoop-2.6./share/hadoop/common/lib/slf4j-log4j12-1.7..jar!/org/slf4j/impl/StaticLoggerBinder.class]
SLF4J: See http://www.slf4j.org/codes.html#multiple_bindings for an explanation.
// :: WARN util.NativeCodeLoader: Unable to load native-hadoop library for your platform... using builtin-java classes where applicable
Connected to: Phoenix (version 4.8)
Driver: PhoenixEmbeddedDriver (version 4.8)
Autocommit status: true
Transaction isolation: TRANSACTION_READ_COMMITTED
Building list of tables and columns for tab-completion (set fastconnect to true to skip)...
/ (%) Done
Done
sqlline version 1.1.
: jdbc:phoenix:master>
退出

Building list of tables and columns for tab-completion (set fastconnect to true to skip)...
/ (%) Done
Done
sqlline version 1.1.
: jdbc:phoenix:master,slave1,slave2:> !exit
Closing: org.apache.phoenix.jdbc.PhoenixConnection
[hadoop@master phoenix]$
这里,建议搭建,你若如跟我一样(master、slave1和slave2)集群的话,zookeeper也是都安装在master、slave1和slave2上,则
使用 sqlline.py 脚本来启动,参数是 zookeeper 集群中各个节点的 hostname ,多个使用逗号隔开,另外端口为 2181

[hadoop@master apache-phoenix-4.8.-HBase-0.98-bin]$ pwd
/home/hadoop/app/apache-phoenix-4.8.-HBase-0.98-bin
[hadoop@master apache-phoenix-4.8.-HBase-0.98-bin]$ bin/sqlline.py master,slave1,slave2:
Setting property: [incremental, false]
Setting property: [isolation, TRANSACTION_READ_COMMITTED]
issuing: !connect jdbc:phoenix:master,slave1,slave2: none none org.apache.phoenix.jdbc.PhoenixDriver
Connecting to jdbc:phoenix:master,slave1,slave2:
SLF4J: Class path contains multiple SLF4J bindings.
SLF4J: Found binding in [jar:file:/home/hadoop/app/apache-phoenix-4.8.-HBase-0.98-bin/phoenix-4.8.-HBase-0.98-client.jar!/org/slf4j/impl/StaticLoggerBinder.class]
SLF4J: Found binding in [jar:file:/home/hadoop/app/hadoop-2.6./share/hadoop/common/lib/slf4j-log4j12-1.7..jar!/org/slf4j/impl/StaticLoggerBinder.class]
SLF4J: See http://www.slf4j.org/codes.html#multiple_bindings for an explanation.
// :: WARN util.NativeCodeLoader: Unable to load native-hadoop library for your platform... using builtin-java classes where applicable
Connected to: Phoenix (version 4.8)
Driver: PhoenixEmbeddedDriver (version 4.8)
Autocommit status: true
Transaction isolation: TRANSACTION_READ_COMMITTED
Building list of tables and columns for tab-completion (set fastconnect to true to skip)...
/ (%) Done
Done
sqlline version 1.1.
: jdbc:phoenix:master,slave1,slave2:>
成功!
安装Phoenix时./sqlline.py执行报错File "./sqlline.py", line 27, in <module> import argparse ImportError: No module named argparse解决办法(图文详解)的更多相关文章
- 安装php时,make步骤报错make: *** [ext/gd/gd.lo] Error 1
安装PHP时,make步骤报错make: *** [ext/gd/gd.lo] Error 1 /usr/local/src/LAMP+memcahed+catci/php-5.4.0/ext/gd/ ...
- 编译Twitter的Heron时一直报错“heron/bazel_configure.py", line 25, in <module> import semver ImportError: No module named semver”如何处理。
今天编译heron的时候,从官方git到的源码bazel_configure的时候一直报错如下: Traceback (most recent call last): File , in <mo ...
- 使用二进制方式安装K8S时使用kubectl命令报错:The connection to the server localhost:8080 was refused - did you specify the right host or port?
解决思路: kubectl 默认从 ~/.kube/config 配置文件获取访问 kube-apiserver 地址.证书.用户名等信息,如果没有配置该文件,或者该文件个别参数配置出错,执行命令时出 ...
- 安装php时,make步骤报错make: *** [sapi/fpm/php-fpm] Error 1
安装PHP过程中,make步骤报错:(集中网络上各种解决方法) (1)-liconv -o sapi/fpm/php-fpm /usr/bin/ld: cannot find -liconv coll ...
- 安装vue时使用npm install 报错
npm ERR! Darwin 14.3.0 npm ERR! argv "/usr/local/Cellar/node/6.4.0/bin/node" "/usr/lo ...
- npm 安装扩展模块时,因缓存报错的问题汇总
1.缓存报错问题一 : unexpected end of file 解决方法:运行:npm cache verify 清除缓存 2.缓存报错问题二 : errno -4048(网上一般说 ...
- svn报错cleanup failed–previous operation has not finished; run cleanup if it was interrupted的解决办法
今天在svn提交的时候它卡顿了一下,我以为已经提交完了,就按了一下,结果就再也恢复不了,也继续不了了... 报错 cleanup failed–previous operation has not f ...
- 类中调用界面ActiveX控件报错当前线程不在单线程单元中因此无法实例化 ActiveX 控件的解决办法
解决办法是Form类中定义一个静态的ActiveX对象,在formload中将界面上的ActiveX对象赋值给新定义的对象,类中访问该静态对象即可. public static AxClientDri ...
- 安装php时,make test报错
Build complete. Don't forget to run 'make test'. [root@localhost php-5.4.5]# make test ERROR: Cannot ...
随机推荐
- ControlExtensionTest(二)-----CCControlSlider
#include "../CCControlScene.h" class CCControlSliderTest : public CCControlScene { public: ...
- C++虚函数表与虚析构函数
1.静态联编和动态联编联编:将源代码中的函数调用解释为要执行函数代码. 静态联编:编译时能确定唯一函数.在C中,每个函数名都能确定唯一的函数代码.在C++中,因为有函数重载,编译器须根据函数名,参数才 ...
- Xcode模拟器的一些快捷键
Cmd+1/2/3 可以切换模拟器的显示比例. Option+Shift 可以在模拟器中调出双指拖动效果. Option 可以在模拟器中调出双指放大缩小效果. Comma ...
- js 学习的地址;
1.https://github.com/windiest/Front-end-tutorial 2.http://www.w3school.com.cn/tags/html_ref_eve ...
- js 时间格式与时间戳的相互转换和计算几天后的日期是哪一天
//把日期转换成时间戳 function get_unix_time(time1){ var newstr = time1.replace(/-/g,'/'); var date = ...
- 国际化的工具类ognl utils
package yycg.util; import java.io.Serializable;import java.text.MessageFormat;import java.util.Array ...
- tomcat 8 加 struts2的 java.lang.NoSuchFieldException: resourceEntries
google发现已经有人把这个bug提交给了apache,issue地址,具体原因就是 Tomcat8 introduce super class WebappClassLoaderBase and ...
- mysql主从复制的介绍
引用:https://my.oschina.net/u/255939/blog/505598 MySQL复制就是一台MySQL服务器(slave)从另一台MySQL服务器(master)进行日志的复制 ...
- 屏幕亮度(XE10.1+WIN8.164)
相关资料: http://bbs.csdn.net/topics/390664310 实例代码: unit Unit1; interface uses Winapi.Windows, Winapi.M ...
- C语言一闪而过
头文件#include<stdlib.h> main函数system("pause");