--- Error: failed to execute '.\ARMCC\bin\ArmAsm'
1.KEIL4在开发STM32程序时报: Error: failed to execute '.\ARMCC\bin\ArmAsm'
或是Error: failed to execute '.\ARMCC\bin40\ArmAsm'等等
2,原因是:程序找不到ArmAsm.exe这个应用程序
3.解决办法:




4.完工,睡觉!
--- Error: failed to execute '.\ARMCC\bin\ArmAsm'的更多相关文章
- Maven进行install的时候报错,COMPILATION ERROR : Failed to execute goal org.apache.maven.plugins:maven-surefire-plugin:2.13:test (default-test) on project cmu: There are test failures.
maven进行install的时候,test类里面报错: COMPILATION ERROR : [INFO] -------------------------------------------- ...
- [ERROR] Failed to execute goal org.apache.maven.plugins:maven-install-plugin:2.3.1:
security-sdk-1.0.jar已经存在于D:/secServerSDK-test/src/main/resources/lib下 报错如下: xxxxxx@xxxxxxxx /d/secSe ...
- [ERROR] Failed to execute goal org.apache.maven.plugins:maven-archetype-plugin:2.4:create (default-cli) on project standalone-pom: Unable to parse configuration of 3: mojo org.apache.maven.plugins:
问题: [ERROR] Failed to execute goal org.apache.maven.plugins:maven-archetype-plugin:2.4:create (defau ...
- [ERROR] Failed to execute goal org.apache.maven.plugins:maven-jar-plugin:2.3.1:jar (default-jar) on
[ERROR] Failed to execute goal org.apache.maven.plugins:maven-jar-plugin:2.3.1:jar (default-jar) on ...
- [ERROR] Failed to execute goal org.apache.maven.plugins:maven-war-plugin:2.2:war (default-war) on project child02
maven打包成war时,报错: [ERROR] Failed to execute goal org.apache.maven.plugins:maven-war-plugin:2.2:war (d ...
- [ERROR] Failed to execute goal org.apache.maven.plugins:maven-compiler-plugin:3.1:compile (default-compile) on project triage: Compilation failure [ERROR] No compiler is provided in this environment.
[ERROR] Failed to execute goal org.apache.maven.plugins:maven-compiler-plugin:3.1:compile (default-c ...
- [ERROR] Failed to execute goal org.apache.maven.plugins:maven-compiler-plugin:3.2:compile (default-compile) on project taotao-manager-pojo: Compilation failure
运行maven项目时报错 [ERROR] Failed to execute goal org.apache.maven.plugins:maven-compiler-plugin:3.2:compi ...
- [ERROR] Failed to execute goal org.codehaus.mojo:gwt-maven-plugin:2.5.0-rc1:compile (default) on project zeus-web: Command 解决
在编译maven项目,打包maven packeage -Dmaven.test.skip=TRUE时,报错“[ERROR] Failed to execute goal org.codehaus.m ...
- 安装vmtools Error: Unable to execute "/usr/bin/vmware-uninstall-tools.pl.
Error: Unable to execute "/usr/bin/vmware-uninstall-tools.pl. 安装vmware tools错误解决办法 很多朋友都在用vmwar ...
随机推荐
- jQuery实现轮播效果(一) - 基础
前戏: XXXX年XX月XX日,经理交给我一个站点新闻资讯网页开发的活儿.我一个java程序猿,怎么完毕得了网页设计这样高端的活儿呢! 之前尽管有学过一点HTML.CSS的知识.可是在实际的使用中,把 ...
- HDU3117-Fibonacci Numbers(矩阵高速幂+log)
题目链接 题意:斐波那契数列,当长度大于8时.要输出前四位和后四位 思路:后四位非常easy,矩阵高速幂取模,难度在于前四位的求解. 已知斐波那契数列的通项公式:f(n) = (1 / sqrt(5 ...
- MySQL 时间类型字段的分析
日期类型 存储空间 日期格式 日期范围---------- ...
- Thinking in Java:容器深入研究
1.虚线框表示Abstract类,图中大量的类的名字都是以Abstract开头的,它们仅仅是部分实现了特定接口的工具,因此创建时能够选择从Abstract继承. Collections中的实用方法:挑 ...
- 详解Google第二代TPU 既能推理又能训练 性能霸道
详解Google第二代TPU 既能推理又能训练 性能霸道 转自:http://www.cnbeta.com/articles/tech/613639.htm 5月18日凌晨,Google CEO Su ...
- UVa 11722(几何概率)
题意:你和你的朋友要乘坐火车,并且都会在A城市相遇,你会在(t1,t2)中的任意时刻以相同的概率密度到达, 你朋友会在(s1,s2)中的任意时刻以相同的概率密度到达,你们的火车在A城市都会停留w分钟, ...
- Hdu-6253 2017CCPC-Final K.Knightmare 规律
题面 题意:给你一个无限大的棋盘,一个象棋中的马,问你这个马,飞n步后,可能的位置有多少种? 题解:看到题,就想先打表试试,于是先写个暴力(枚举每个位置,是马就飞周围8个格子,注意不要在同个循环里把格 ...
- vim产生的.swap文件
转载自 http://ibeyond.blog.51cto.com/1988404/800138 有时候在用vim打开文件时提示类似以下的信息: E325: 注意发现交换文件 ".expor ...
- Oracle性能优化——总体介绍
最近参加Oracle的培训,对Oracle有了更加深入的认识,在此做个学习总结. 1.Oracle数据库调优不能仅指望修改几项数据库参数就能有明显效果,问题更多出在应用方面,教育开发者正确地使用数据库 ...
- 1.Ventuz 介绍
Ventoz能做什么? Ventuz是一款实时图文包装内容创作.制作和播出控制软件.Ventuz专注于高端视听内容的制作,包括交互展示和大型活动.视频墙.广播电视在线包装及演播室舞台及灯光控制等领域. ...