//usr/lib64/liblber-2.4.so.2: error adding symbols: DSO missing from command line

collect2: error: ld returned 1 exit status
make: *** [sapi/cli/php] Error 1 解决方法:vi Makefile 找到 EXTRA_LIBS 行,在行末添加 ‘ -llber ‘ 保存退出再次make即可

PHP编译报错的更多相关文章

  1. 使用C#模拟Outlook发送邮件,代码编译报错

    添加OutLook API using OutLook = Microsoft.Office.Interop.Outlook; 发送邮件方法 public void SendEmail() { Out ...

  2. cordova编译报错:Execution failed for task ':processDebugResources'

    cordova编译报错:Execution failed for task ':processDebugResources' 引发这个错误的最扩祸首就是一个中文命名的文件,不知道什么时候加入的,我写了 ...

  3. 编译报错dereferencing pointer to incomplete type

    关于编译报错“dereferencing pointer to incomplete type... 多是没找到结构体的定义,可以在本地复制其定义试试. 参考: http://my.oschina.n ...

  4. Maven-010-maven 编译报错:Failure to ... in ... was cached in the local repository, resolution will not be reattempted until the update interval of nexus has elapsed or updates are forced.

    今晚在编译 maven 项目的时候,命令行报错,出现 Failure to ... in ... 类似错误,详细的错误信息如下所示: [INFO] -------------------------- ...

  5. [Intellij] 编译报错 javacTask

    报错信息: Idea 编译报错 javacTask: 源发行版 1.6 需要目标发行版 1.6 解决方案:

  6. jenkis编译报错:需要class,interface或enum

    现象: 1.jenkis编译报错:需要class,interface或enum 2.使用ant进行编译ok. 解决方法: 1. Jenkis重新编译一个以前成功的svn版本,直至编译成功. 2.Jen ...

  7. 对arm指令集的疑惑,静态库运行,编译报错等问题

    转载自http://www.jianshu.com/p/4a70aa03a4ea?utm_campaign=hugo&utm_medium=reader_share&utm_conte ...

  8. xocde7下导入libsqlite3.tbd编译报错的解决办法

    在xocde7下没有libsqlite3.dylib,只有libsqlite3.tbd,然后我导入了tbd.编译报错error: /Applications/Xcode.app/Contents/De ...

  9. 关于vue-clidown到本地后,拷贝文件库到另外一台电脑上npm run dev编译报错的处理

    这些天自己在用vue-cli项目,在家里的电脑下下来后写了一些demo,拿到公司继续开发的时候发现删除node_modules文件,运行npm install和npm run 百度,搜狗了好久都没有找 ...

  10. openldap 编译报错MozNSS not found

    openldap 编译报错 1)报错 MozNSS not found - please specify the location to the NSPR and NSS header files i ...

随机推荐

  1. CodeBlocks(17.12) 代码调试基础方法&快捷方式

    转载:CodeBlocks(17.12) 代码调试基础方法&快捷方式: https://www.cnblogs.com/DCD112358/p/8998053.html

  2. php页面编码设置

    php的header来定义一个php页面为utf编码或GBK编码 php页面为utf编码 header("Content-type: text/html; charset=utf-8&quo ...

  3. Laravel -- 邮箱功能配置问题

    ```` 今天碰到了这块的问题,还是记一下 ```` 关于邮箱: 品牌:腾讯qq.网易163 等 种类:个人.企业 邮箱服务器种类 配置教程 https://jingyan.baidu.com/art ...

  4. [Linux]权限s权限和t权限

    问题 在<Unix高级编程>第4.9章节中描述了函数chmod()的参数mode常量值 当中S_ISUID.S_ISGID.S_ISVTX三个常量让人困惑. 分析 通过查阅文档,发现这几个 ...

  5. hasOne、hasMany、belongsTo

    这里将hasOne.hasMany.belongsTo进行一个详细举例说明. 首先,这3个的大致中文意思: hasOne:有一个,加上主谓语应该是 ,A 有一个 B hasMany:有很多,A 有很多 ...

  6. 服务器与本地的控制工具unison

    中文文档:https://wiki.archlinux.org/index.php/Unison_(%E7%AE%80%E4%BD%93%E4%B8%AD%E6%96%87) 下载:http://un ...

  7. Accumulation Degree

    #include<cstdio> #include<cstring> #define INF 0x7fffffff using namespace std; ; inline ...

  8. thinkphp5调用阿里大鱼短信

    :在Controller.php public function send() { if (request()->isPost()) { $phone = input('post.phone/s ...

  9. Swift 统计项目中所有按钮的点击次数

    class Swizzle: NSObject { override class func load() { UIButton.xxx_swizzleSendAction() } } extensio ...

  10. 通过linux版本的lr agent提示找不到web_reg_save_param_ex函数

    Action.c(5): Error: C interpreter run time error: /tmp/brr_TSBgR2/netdir/E/lrscript/aaa/Action.c (5) ...