从eclipse复制的依赖注解,一运行测试脚本发现报错如下:

"F:\Program Files\Java\jdk1.7.0_17\bin\java" -ea -Didea.launcher.port=7533 "-Didea.launcher.bin.path=F:\Program Files (x86)\JetBrains\IntelliJ IDEA 14.1\bin" -Dfile.encoding=UTF-8 -classpath "F:\Program Files (x86)\JetBrains\IntelliJ IDEA 14.1\plugins\testng\lib\testng-plugin.jar;F:\Program Files\Java\jdk1.7.0_17\jre\lib\charsets.jar;F:\Program Files\Java\jdk1.7.0_17\jre\lib\deploy.jar;F:\Program Files\Java\jdk1.7.0_17\jre\lib\javaws.jar;F:\Program Files\Java\jdk1.7.0_17\jre\lib\jce.jar;F:\Program Files\Java\jdk1.7.0_17\jre\lib\jfr.jar;F:\Program Files\Java\jdk1.7.0_17\jre\lib\jfxrt.jar;F:\Program Files\Java\jdk1.7.0_17\jre\lib\jsse.jar;F:\Program Files\Java\jdk1.7.0_17\jre\lib\management-agent.jar;F:\Program Files\Java\jdk1.7.0_17\jre\lib\plugin.jar;F:\Program Files\Java\jdk1.7.0_17\jre\lib\resources.jar;F:\Program Files\Java\jdk1.7.0_17\jre\lib\rt.jar;F:\Program Files\Java\jdk1.7.0_17\jre\lib\ext\access-bridge-64.jar;F:\Program Files\Java\jdk1.7.0_17\jre\lib\ext\dnsns.jar;F:\Program Files\Java\jdk1.7.0_17\jre\lib\ext\jaccess.jar;F:\Program Files\Java\jdk1.7.0_17\jre\lib\ext\localedata.jar;F:\Program Files\Java\jdk1.7.0_17\jre\lib\ext\sunec.jar;F:\Program Files\Java\jdk1.7.0_17\jre\lib\ext\sunjce_provider.jar;F:\Program Files\Java\jdk1.7.0_17\jre\lib\ext\sunmscapi.jar;F:\Program Files\Java\jdk1.7.0_17\jre\lib\ext\zipfs.jar;E:\workespace\demotest\target\classes;E:\repository\org\testng\testng\6.9.10\testng-6.9.10.jar;E:\repository\com\beust\jcommander\1.48\jcommander-1.48.jar;E:\repository\org\beanshell\bsh\2.0b4\bsh-2.0b4.jar;E:\repository\selenium-server-standalone\selenium-server-standalone\2.53\selenium-server-standalone-2.53.jar;F:\Program Files (x86)\JetBrains\IntelliJ IDEA 14.1\plugins\testng\lib\testng.jar;F:\Program Files (x86)\JetBrains\IntelliJ IDEA 14.1\lib\idea_rt.jar" com.intellij.rt.execution.application.AppMain org.testng.RemoteTestNGStarter -port 65416 -usedefaultlisteners false -socket65417 -temp F:\temp\idea_testng4.tmp
org.testng.TestNGException: org.xml.sax.SAXParseException; lineNumber: 3; columnNumber: 44; 值为 "none" 的属性 "parallel" 必须具有列表 "false methods tests classes instances " 中的值。
at org.testng.TestNG.initializeSuitesAndJarFile(TestNG.java:325)
at org.testng.remote.RemoteTestNG.run(RemoteTestNG.java:90)
at org.testng.remote.RemoteTestNG.initAndRun(RemoteTestNG.java:206)
at org.testng.remote.RemoteTestNG.main(RemoteTestNG.java:177)
at org.testng.RemoteTestNGStarter.main(RemoteTestNGStarter.java:125)
at sun.reflect.NativeMethodAccessorImpl.invoke0(Native Method)
at sun.reflect.NativeMethodAccessorImpl.invoke(NativeMethodAccessorImpl.java:57)
at sun.reflect.DelegatingMethodAccessorImpl.invoke(DelegatingMethodAccessorImpl.java:43)
at java.lang.reflect.Method.invoke(Method.java:601)
at com.intellij.rt.execution.application.AppMain.main(AppMain.java:140)
Caused by: org.xml.sax.SAXParseException; lineNumber: 3; columnNumber: 44; 值为 "none" 的属性 "parallel" 必须具有列表 "false methods tests classes instances " 中的值。
at com.sun.org.apache.xerces.internal.util.ErrorHandlerWrapper.createSAXParseException(ErrorHandlerWrapper.java:198)
at com.sun.org.apache.xerces.internal.util.ErrorHandlerWrapper.error(ErrorHandlerWrapper.java:134)
at com.sun.org.apache.xerces.internal.impl.XMLErrorReporter.reportError(XMLErrorReporter.java:437)
at com.sun.org.apache.xerces.internal.impl.XMLErrorReporter.reportError(XMLErrorReporter.java:368)
at com.sun.org.apache.xerces.internal.impl.XMLErrorReporter.reportError(XMLErrorReporter.java:325)
at com.sun.org.apache.xerces.internal.impl.dtd.XMLDTDValidator.validateDTDattribute(XMLDTDValidator.java:1392)
at com.sun.org.apache.xerces.internal.impl.dtd.XMLDTDValidator.addDTDDefaultAttrsAndValidate(XMLDTDValidator.java:1311)
at com.sun.org.apache.xerces.internal.impl.dtd.XMLDTDValidator.handleStartElement(XMLDTDValidator.java:1917)
at com.sun.org.apache.xerces.internal.impl.dtd.XMLDTDValidator.startElement(XMLDTDValidator.java:742)
at com.sun.org.apache.xerces.internal.impl.XMLNSDocumentScannerImpl.scanStartElement(XMLNSDocumentScannerImpl.java:376)
at com.sun.org.apache.xerces.internal.impl.XMLNSDocumentScannerImpl$NSContentDriver.scanRootElementHook(XMLNSDocumentScannerImpl.java:602)
at com.sun.org.apache.xerces.internal.impl.XMLDocumentFragmentScannerImpl$FragmentContentDriver.next(XMLDocumentFragmentScannerImpl.java:3065)
at com.sun.org.apache.xerces.internal.impl.XMLDocumentScannerImpl$PrologDriver.next(XMLDocumentScannerImpl.java:881)
at com.sun.org.apache.xerces.internal.impl.XMLDocumentScannerImpl.next(XMLDocumentScannerImpl.java:607)
at com.sun.org.apache.xerces.internal.impl.XMLNSDocumentScannerImpl.next(XMLNSDocumentScannerImpl.java:116)
at com.sun.org.apache.xerces.internal.impl.XMLDocumentFragmentScannerImpl.scanDocument(XMLDocumentFragmentScannerImpl.java:489)
at com.sun.org.apache.xerces.internal.parsers.XML11Configuration.parse(XML11Configuration.java:835)
at com.sun.org.apache.xerces.internal.parsers.XML11Configuration.parse(XML11Configuration.java:764)
at com.sun.org.apache.xerces.internal.parsers.XMLParser.parse(XMLParser.java:123)
at com.sun.org.apache.xerces.internal.parsers.AbstractSAXParser.parse(AbstractSAXParser.java:1210)
at com.sun.org.apache.xerces.internal.jaxp.SAXParserImpl$JAXPSAXParser.parse(SAXParserImpl.java:568)
at com.sun.org.apache.xerces.internal.jaxp.SAXParserImpl.parse(SAXParserImpl.java:302)
at javax.xml.parsers.SAXParser.parse(SAXParser.java:195)
at org.testng.xml.XMLParser.parse(XMLParser.java:39)
at org.testng.xml.SuiteXmlParser.parse(SuiteXmlParser.java:16)
at org.testng.xml.SuiteXmlParser.parse(SuiteXmlParser.java:9)
at org.testng.xml.Parser.parse(Parser.java:172)
at org.testng.TestNG.initializeSuitesAndJarFile(TestNG.java:305)
... 9 more
Picked up JAVA_TOOL_OPTIONS: -Dfile.encoding=UTF-8

Process finished with exit code 0

解决方案:

原因为6.9.10版本的testng,开始验证xml中的元素;而idea默认的testng.xml模板中parallel设置为none,因此报错。

所以解决方法:

1. testng 使用6.9.9

或者

2. testng使用6.9.10, 在testng.xml中parallel设置为false

效果如下:

IDEA运行TestNG报错rg.testng.TestNGException: org.xml.sax.SAXParseException;的更多相关文章

  1. 在ios7真机上和iOS6模拟器上运行是好的,而在iOS6真机上运行却报错

    在ios7真机上和iOS6模拟器上运行是好的,而在iOS6真机上运行却报错 解决方法: 或是都设置为yes.. Build Active Architecture Only的意思是只生成适应的指令集

  2. 运行yum报错Error: Cannot retrieve metalink for reposit

    http://www.netpc.com.cn/593.html 运行yum报错Error: Cannot retrieve metalink for reposit 今天给Centos通过rpm - ...

  3. 转:运行yum报错Error: Cannot retrieve metalink for reposit

    http://www.netpc.com.cn/593.html 运行yum报错Error: Cannot retrieve metalink for repository: epel. Please ...

  4. 新建SpringBoot项目运行页面报错Whitelabel Error Page This application has no explicit mapping for /error, so yo

    新建SpringBoot项目运行页面报错Whitelabel Error Page This application has no explicit mapping for /error, so yo ...

  5. 安装了nodejs后在命令行运行npm报错

    安装了nodejs后在命令行运行npm报错:Error: Cannot find module 'internal/util/types' 解决方法:删除目录“C:\Users\mengxiaobo\ ...

  6. manjaro运行virtualbox报错

    manjaro运行virtualbox报错manjaro使用添加删除程序搜索virtualbox安装后运行报错, 安装过程有选择modules的过程(这里要选择匹配当前系统内核的版本),当时不了解是干 ...

  7. vs2010一运行就报错deven.exe assert failure 解决方法,卸载系统中.netFramework最新版本的(简体中文)

    vs2010一运行就报错deven.exe assert failure 解决方法,卸载系统中.netFramework最新版本的(简体中文)

  8. homestead虚拟机,通过npm下载依赖包和解决运行gulp报错问题 yarn出错问题

    homestead虚拟机,通过npm下载依赖包和解决运行gulp报错问题 yarn出错问题 1. 在虚拟器运行 npm 下载依赖组件时报错: npm ERR! EPROTO: protocol err ...

  9. Mac上PyCharm运行多进程报错的解决方案

    Mac上PyCharm运行多进程报错的解决方案 运行时报错 may have been in progress in another thread when fork() was called. We ...

随机推荐

  1. 有趣的filter

    js中的filter就是过滤的意思,比如,我们以什么样的方式进行过滤,得到我们想要的结果. 对,我们要的就是这个结果. 给定一个数组,我们要的是Burger(汉堡) const restaurants ...

  2. 多线程(Thread,Runnable)

    一.多线程. 1.进程:一个正在执行的程序叫做进程. 每一个进程的执行都有一个执行顺序,这个顺序就是一个执行的路径,或者叫做一个控制单元. 2.线程:就是上述进程中的一个独立控制单元, 线程在控制着进 ...

  3. MyEclipse导入Maven项目以及Maven转化为Dynamic Web Module(转)

    MyEclipse导入Maven项目(这个博主写的比较详细)https://blog.csdn.net/w12345_ww/article/details/52094756 Maven转化为Dynam ...

  4. ElasticSearch 之 dis_max tie_break的应用

    1. 插入数据 PUT /my_index/my_type/ { "title": "Quick brown rabbits", "body" ...

  5. SVN的Windows和Linux客户端操作详解

    SVN的Windows和Linux客户端操作详解 作者:尹正杰 版权声明:原创作品,谢绝转载!否则将追究法律责任. 一.Windows客户端操作 1.安装SVN客户端 a>.去官网下载svn软件 ...

  6. JavaEE学习总结(十二)—MyEclipse开发工具与HTML

    一.MyEclipse MyEclipse,是在eclipse 基础上加上自己的插件开发而成的功能强大的企业级集成开发环境,主要用于Java.Java EE以及移动应用的开发.MyEclipse的功能 ...

  7. JAVA记录-异常基本概念

    1.异常分类 2.错误和异常的区别 3.try-catch-xxx处理方式 Java Exception:1.Error 2.Runtime Exception 运行时异常3.Exception 4. ...

  8. Java Map 按Key排序和按Value排序【转】【补】

    package kingtool.sort; import java.util.ArrayList; import java.util.Collections; import java.util.Co ...

  9. AtCoder Regular Contest 077 E - guruguru

    https://arc077.contest.atcoder.jp/tasks/arc077_c 有m个点围成一个圈,按顺时针编号为1到m,一开始可以固定一个位置x,每次操作可以往顺时针方向走一步或直 ...

  10. 一步一步配置 Dell OME 监控 Dell 服务器硬件报警

    本文包括以下四个部分: 下载 Dell OME 安装 Dell OME 配置 Dell OME 配置 iDRAC 下载 Dell OME 以Dell PowerEdge R730xd 为例 1.登录 ...