// :: WARN RandomBlockReplicationPolicy: Expecting  replicas with only  peer/s.
// :: WARN BlockManager: Block input-- replicated to only peer(s) instead of peers
// :: ERROR Executor: Exception in task 0.0 in stage 113711.0 (TID )
java.lang.AssertionError: assertion failed
at scala.Predef$.assert(Predef.scala:)
at org.apache.spark.storage.BlockInfo.checkInvariants(BlockInfoManager.scala:)
at org.apache.spark.storage.BlockInfo.readerCount_$eq(BlockInfoManager.scala:)
at org.apache.spark.storage.BlockInfoManager$$anonfun$releaseAllLocksForTask$$$anonfun$apply$.apply(BlockInfoManager.scala:)
at org.apache.spark.storage.BlockInfoManager$$anonfun$releaseAllLocksForTask$$$anonfun$apply$.apply(BlockInfoManager.scala:)
at scala.Option.foreach(Option.scala:)
at org.apache.spark.storage.BlockInfoManager$$anonfun$releaseAllLocksForTask$.apply(BlockInfoManager.scala:)
at org.apache.spark.storage.BlockInfoManager$$anonfun$releaseAllLocksForTask$.apply(BlockInfoManager.scala:)
at scala.collection.Iterator$class.foreach(Iterator.scala:)
at scala.collection.AbstractIterator.foreach(Iterator.scala:)
at org.apache.spark.storage.BlockInfoManager.releaseAllLocksForTask(BlockInfoManager.scala:)
at org.apache.spark.storage.BlockManager.releaseAllLocksForTask(BlockManager.scala:)
at org.apache.spark.executor.Executor$TaskRunner.run(Executor.scala:)
at java.util.concurrent.ThreadPoolExecutor.runWorker(ThreadPoolExecutor.java:)
at java.util.concurrent.ThreadPoolExecutor$Worker.run(ThreadPoolExecutor.java:)
at java.lang.Thread.run(Thread.java:)
// :: WARN TaskSetManager: Lost task 0.0 in stage 113711.0 (TID , localhost, executor driver): java.lang.AssertionError: assertion failed
at scala.Predef$.assert(Predef.scala:)
at org.apache.spark.storage.BlockInfo.checkInvariants(BlockInfoManager.scala:)
at org.apache.spark.storage.BlockInfo.readerCount_$eq(BlockInfoManager.scala:)
at org.apache.spark.storage.BlockInfoManager$$anonfun$releaseAllLocksForTask$$$anonfun$apply$.apply(BlockInfoManager.scala:)
at org.apache.spark.storage.BlockInfoManager$$anonfun$releaseAllLocksForTask$$$anonfun$apply$.apply(BlockInfoManager.scala:)
at scala.Option.foreach(Option.scala:)
at org.apache.spark.storage.BlockInfoManager$$anonfun$releaseAllLocksForTask$.apply(BlockInfoManager.scala:)
at org.apache.spark.storage.BlockInfoManager$$anonfun$releaseAllLocksForTask$.apply(BlockInfoManager.scala:)
at scala.collection.Iterator$class.foreach(Iterator.scala:)
at scala.collection.AbstractIterator.foreach(Iterator.scala:)
at org.apache.spark.storage.BlockInfoManager.releaseAllLocksForTask(BlockInfoManager.scala:)
at org.apache.spark.storage.BlockManager.releaseAllLocksForTask(BlockManager.scala:)
at org.apache.spark.executor.Executor$TaskRunner.run(Executor.scala:)
at java.util.concurrent.ThreadPoolExecutor.runWorker(ThreadPoolExecutor.java:)
at java.util.concurrent.ThreadPoolExecutor$Worker.run(ThreadPoolExecutor.java:)
at java.lang.Thread.run(Thread.java:) // :: ERROR TaskSetManager: Task in stage 113711.0 failed times; aborting job
// :: ERROR JobScheduler: Error running job streaming job ms.
org.apache.spark.SparkException: An exception was raised by Python:
Traceback (most recent call last):
File "/home/admin/agent/spark/python/lib/pyspark.zip/pyspark/streaming/util.py", line , in call
r = self.func(t, *rdds)
File "/home/admin/agent/spark/python/lib/pyspark.zip/pyspark/streaming/dstream.py", line , in takeAndPrint
taken = rdd.take(num + )
File "/home/admin/agent/spark/python/lib/pyspark.zip/pyspark/rdd.py", line , in take
res = self.context.runJob(self, takeUpToNumLeft, p)
File "/home/admin/agent/spark/python/lib/pyspark.zip/pyspark/context.py", line , in runJob
port = self._jvm.PythonRDD.runJob(self._jsc.sc(), mappedRDD._jrdd, partitions)
File "/home/admin/agent/spark/python/lib/py4j-0.10.4-src.zip/py4j/java_gateway.py", line , in __call__
answer, self.gateway_client, self.target_id, self.name)
File "/home/admin/agent/spark/python/lib/py4j-0.10.4-src.zip/py4j/protocol.py", line , in get_return_value
format(target_id, ".", name), value)
py4j.protocol.Py4JJavaError: An error occurred while calling z:org.apache.spark.api.python.PythonRDD.runJob.
: org.apache.spark.SparkException: Job aborted due to stage failure: Task in stage 113711.0 failed times, most recent failure: Lost task 0.0 in stage 113711.0 (TID , localhost, executor driver): java.lang.AssertionError: assertion failed
at scala.Predef$.assert(Predef.scala:)
at org.apache.spark.storage.BlockInfo.checkInvariants(BlockInfoManager.scala:)
at org.apache.spark.storage.BlockInfo.readerCount_$eq(BlockInfoManager.scala:)
at org.apache.spark.storage.BlockInfoManager$$anonfun$releaseAllLocksForTask$$$anonfun$apply$.apply(BlockInfoManager.scala:)
at org.apache.spark.storage.BlockInfoManager$$anonfun$releaseAllLocksForTask$$$anonfun$apply$.apply(BlockInfoManager.scala:)
at scala.Option.foreach(Option.scala:)
at org.apache.spark.storage.BlockInfoManager$$anonfun$releaseAllLocksForTask$.apply(BlockInfoManager.scala:)
at org.apache.spark.storage.BlockInfoManager$$anonfun$releaseAllLocksForTask$.apply(BlockInfoManager.scala:)
at scala.collection.Iterator$class.foreach(Iterator.scala:)
at scala.collection.AbstractIterator.foreach(Iterator.scala:)
at org.apache.spark.storage.BlockInfoManager.releaseAllLocksForTask(BlockInfoManager.scala:)
at org.apache.spark.storage.BlockManager.releaseAllLocksForTask(BlockManager.scala:)
at org.apache.spark.executor.Executor$TaskRunner.run(Executor.scala:)
at java.util.concurrent.ThreadPoolExecutor.runWorker(ThreadPoolExecutor.java:)
at java.util.concurrent.ThreadPoolExecutor$Worker.run(ThreadPoolExecutor.java:)
at java.lang.Thread.run(Thread.java:)
  
Driver stacktrace:
at org.apache.spark.scheduler.DAGScheduler.org$apache$spark$scheduler$DAGScheduler$$failJobAndIndependentStages(DAGScheduler.scala:)
at org.apache.spark.scheduler.DAGScheduler$$anonfun$abortStage$.apply(DAGScheduler.scala:)
at org.apache.spark.scheduler.DAGScheduler$$anonfun$abortStage$.apply(DAGScheduler.scala:)
at scala.collection.mutable.ResizableArray$class.foreach(ResizableArray.scala:)
at scala.collection.mutable.ArrayBuffer.foreach(ArrayBuffer.scala:)
at org.apache.spark.scheduler.DAGScheduler.abortStage(DAGScheduler.scala:)
at org.apache.spark.scheduler.DAGScheduler$$anonfun$handleTaskSetFailed$.apply(DAGScheduler.scala:)
at org.apache.spark.scheduler.DAGScheduler$$anonfun$handleTaskSetFailed$.apply(DAGScheduler.scala:)
at scala.Option.foreach(Option.scala:)
at org.apache.spark.scheduler.DAGScheduler.handleTaskSetFailed(DAGScheduler.scala:)
at org.apache.spark.scheduler.DAGSchedulerEventProcessLoop.doOnReceive(DAGScheduler.scala:)
at org.apache.spark.scheduler.DAGSchedulerEventProcessLoop.onReceive(DAGScheduler.scala:)
at org.apache.spark.scheduler.DAGSchedulerEventProcessLoop.onReceive(DAGScheduler.scala:)
at org.apache.spark.util.EventLoop$$anon$.run(EventLoop.scala:)
at org.apache.spark.scheduler.DAGScheduler.runJob(DAGScheduler.scala:)
at org.apache.spark.SparkContext.runJob(SparkContext.scala:)
at org.apache.spark.SparkContext.runJob(SparkContext.scala:)
at org.apache.spark.SparkContext.runJob(SparkContext.scala:)
at org.apache.spark.api.python.PythonRDD$.runJob(PythonRDD.scala:)
at org.apache.spark.api.python.PythonRDD.runJob(PythonRDD.scala)
at sun.reflect.GeneratedMethodAccessor55.invoke(Unknown Source)
at sun.reflect.DelegatingMethodAccessorImpl.invoke(DelegatingMethodAccessorImpl.java:)
at java.lang.reflect.Method.invoke(Method.java:)
at py4j.reflection.MethodInvoker.invoke(MethodInvoker.java:)
at py4j.reflection.ReflectionEngine.invoke(ReflectionEngine.java:)
at py4j.Gateway.invoke(Gateway.java:)
at py4j.commands.AbstractCommand.invokeMethod(AbstractCommand.java:)
at py4j.commands.CallCommand.execute(CallCommand.java:)
at py4j.GatewayConnection.run(GatewayConnection.java:)
at java.lang.Thread.run(Thread.java:)

排查原因1:

  1. 【不是】由于代码中checkpoint目录为本地导致,搭建了hdfs,将checkpoint移到hdfs,发现还是运行一天左右就挂掉,报错如上。

  2. 待续

请大虾们指点。

filebeat+kafka+SparkStreaming程序报错及解决办法的更多相关文章

  1. 【Runtime Error】打开Matlib7.0运行程序报错的解决办法

    1.在C盘建立一个文件夹temp,存放临时文件: 2.右键我的电脑-属性-高级系统设置-环境变量-系统变量,将TEMP.TMP的值改成C:\temp: 3.还是在第2步那里,新建变量,变量名称为BLA ...

  2. 未在本地计算机上注册“microsoft.ACE.oledb.12.0”提供程序报错的解决办法

    https://www.jb51.net/article/157457.htm 下载32位版本安装即可 Microsoft Access Database Engine Redistributable ...

  3. Base64 报错 的解决办法 (Base-64 字符数组或字符串的长度无效。, 输入的不是有效的 Base-64 字符串,因为它包含非 Base-64 字符、两个以上的填充字符,或者填充字符间包含非法字符。)

    Base64 报错 的解决办法, 报错如下:1. FormatException: The input is not a valid Base-64 string as it contains a n ...

  4. Springboot数据库连接池报错的解决办法

    Springboot数据库连接池报错的解决办法 这个异常通常在Linux服务器上会发生,原因是Linux系统会主动断开一个长时间没有通信的连接 那么我们的问题就是:数据库连接池长时间处于间歇状态,导致 ...

  5. Loadrunner参数化连接oracle、mysql数据源报错及解决办法

    Loadrunner参数化连接oracle.mysql数据源报错及解决办法 (本人系统是Win7 64,  两位小伙伴因为是默认安装lr,安装在 最终参数化的时候,出现连接字符串无法自动加载出来: 最 ...

  6. PHP empty函数报错的解决办法

    PHP empty函数在检测一个非变量情况下报错的解决办法. PHP开发时,当你使用empty检查一个函数返回的结果时会报错:Fatal error: Can't use function retur ...

  7. eclipse中的js文件报错的解决办法

    在使用别人的项目的时候,导入到eclipse中发现js文件报错,解决办法是关闭eclipse的js校验功能. 三个步骤: 1. 右键点击项目->properties->Validation ...

  8. VM装mac10.9教程+报错信息解决办法

    VM装mac10.9教程+报错信息解决办法 教程1: 教你在Vmware 10下安装苹果Mac10.9系统 地址:http://tieba.baidu.com/p/2847457021 教程2: VM ...

  9. Oracle数据库误删文件导致rman备份报错RMAN-06169解决办法

    Oracle数据库误删文件导致rman备份报错RMAN-06169解决办法 可能是误删文件导致在使用rman备份时候出现以下提示 RMAN-06169: could not read file hea ...

随机推荐

  1. JavaScript文件引入方式区别

    1.JavaScript文件引入方式 (1)正常引入 <script src="http://libs.baidu.com/jquery/2.0.0/jquery.min.js&quo ...

  2. chrome插件的popup与跨域请求

    chrome插件的popup与跨域请求 tkorays <tkorays@hotmail.com> popup及其它js脚本         在chrome插件开发中,大致有几种类型的js ...

  3. 解决 /dev/mapper/* 100%

    1.查看大文件位置du -sh /* | sort -nr 2.分析,处理文件

  4. 通过jaxws-ri创建webservice服务端和客户端

    1. 获得开发包 当然是到 SUN 的开发网站下载 JAX-WS RI,或者下载我的网盘备份 ,下载下来的只是一个jar包,参考官网上的方法在命令行调用:java -jar JAXWS2.1.2-20 ...

  5. maven 将jar包添加到本地仓库

      maven  如何将jar包添加到本地仓库 CreateTime--2018年4月19日12:50:50 Author:Marydon 情景描述:当项目所需的jar包,maven中央仓库中没有该j ...

  6. 求不小于N且二进制串包含K个1的最小的数字

    给定正整数N,求一个最小正整数M(M>=N),使得M中连续1的个数不小于K. 输入格式:N K 其中N为大整数,只能进行字符串处理 首先要把N化为二进制串,考察这个二进制串的最后K位: 直接把这 ...

  7. oracle导表小结

    事件描述:从A主机oracle服务器导出.sql文件到B主机,发现1.导入存在乱码 2.提示USERS表空没有权限(A B主机均为window系统) 1.针对第一点乱码 首先确认系统的默认字符编码GB ...

  8. 以宽字符形式读整个文件的内容(wifstream的使用)

    // TestShlwAPI.cpp : 定义控制台应用程序的入口点.// #include "stdafx.h" #include <iostream>using s ...

  9. Linux内核同步 - Seqlock

    一.前言 普通的spin lock对待reader和writer是一视同仁,RW spin lock给reader赋予了更高的优先级,那么有没有让writer优先的锁的机制呢?答案就是seqlock. ...

  10. Spring +quartz获取ApplicationContext上下文

    job存在数据库中,能够进行动态的增增删改查,近期遇到了怎样获取ApplicationContext上下文的问题.解决的方法例如以下 applicationContext-quartz.xml < ...