从Windows平台通过FTP上传一个大小约为6G的zip文件到Linux系统(Oracle Linux Server release 5.7)上,解压过程中出现如下错误:

   1: [root@gsp tmp]# unzip -n OracleLinuxandPataches.zip -d /u02/tmp

   2: error:  Zip file too big (greater than 4294959102 bytes)

   3: Archive:  OracleLinuxandPataches.zip

   4: warning [OracleLinuxandPataches.zip]:  2107863523 extra bytes at beginning or within zipfile

   5:   (attempting to process anyway)

   6: error [OracleLinuxandPataches.zip]:  start of central directory not found;

   7:   zipfile corrupt.

   8:   (please check that you have transferred or created the zipfile in the

   9:   appropriate BINARY mode and that you have compiled UnZip properly)

                                                                                                 截图如下

                    

从网上搜索了一下相关资料,发现是当前的unzip版本不支持4G以上的压缩包。要么升级到最新版本的unzip,要么使用7-Zip forLinux版本的的p7zip。

如下所示,当前的unzip版本为5.52

   1: [root@gsp database]# unzip -v

   2: UnZip 5.52 of 28 February 2005, by Info-ZIP.  Maintained by C. Spieler.  Send

   3: bug reports using http://www.info-zip.org/zip-bug.html; see README for details.

   4:  

   5: Latest sources and executables are at ftp://ftp.info-zip.org/pub/infozip/ ;

   6: see ftp://ftp.info-zip.org/pub/infozip/UnZip.html for other sites.

   7:  

   8: Compiled with gcc 4.1.2 20080704 (Red Hat 4.1.2-44) for Unix (Linux ELF) on Apr  8 2009.

   9:  

  10: UnZip special compilation options:

  11:         COPYRIGHT_CLEAN (PKZIP 0.9x unreducing method not supported)

  12:         SET_DIR_ATTRIB

  13:         TIMESTAMP

  14:         USE_EF_UT_TIME

  15:         USE_UNSHRINK (PKZIP/Zip 1.x unshrinking method supported)

  16:         USE_DEFLATE64 (PKZIP 4.x Deflate64(tm) supported)

  17:         VMS_TEXT_CONV

  18:         [decryption, version 2.9 of 05 May 2000]

  19:  

  20: UnZip and ZipInfo environment options:

  21:            UNZIP:  [none]

  22:         UNZIPOPT:  [none]

  23:          ZIPINFO:  [none]

  24:       ZIPINFOOPT:  [none]

于是我从http://sourceforge.net/projects/p7zip/files/p7zip/上下载了p7zip_9.20.1_src_all.tar.bz2 安装包文件。

   1: [root@gsp tmp]# tar -xjpf   p7zip_9.20.1_src_all.tar.bz2

   2: [root@gsp tmp]cd p7zip_9.20.1

   3: [root@gsp p7zip_9.20.1]# make && make install

   4: mkdir -p bin

   5: make -C CPP/7zip/Bundles/Alone all

   6: make[1]: Entering directory `/u02/tmp/p7zip_9.20.1/CPP/7zip/Bundles/Alone'

   7: g++ -O -pipe -s -D_FILE_OFFSET_BITS=64 -D_LARGEFILE_SOURCE -DNDEBUG -D_REENTRANT -DENV_UNIX -D_7ZIP_LARGE_PAGES -DBREAK_HANDLER -DUNICODE -D_UNICODE -c -I. -I../../../myWindows -I../../../ -I../../../include_windows ../../../myWindows/myGetTickCount.cpp

   8: make[1]: g++: Command not found

   9: make[1]: *** [myGetTickCount.o] Error 127

  10: make[1]: Leaving directory `/u02/tmp/p7zip_9.20.1/CPP/7zip/Bundles/Alone'

  11: make: *** [7za] Error 2

  12:  

结果安装过程中出现上面错误,出现上面错误是因为这台服务器是刚安装的测试服务器,还没有安装gcc和gcc-c++包。

   1: [root@gsp Server]# rpm -q gcc gcc-c++

   2: package gcc is not installed

   3: package gcc-c++ is not installed

于是配置YUM源后,安装gcc 和 gcc-c++

   1: [root@gsp yum.repos.d]# more rhel-debuginfo.repo 

   2: [rhel-debuginfo]

   3:  

   4: name=Red Hat Enterprise Linux LOCAL SOURCE

   5:  

   6: baseurl=file:///mnt/cdrom/Server

   7:  

   8: enabled=1

   9:  

  10: gpgcheck=0

  11:  

  12:  

  13:  

  14: [root@gsp yum.repos.d]# yum install gcc

  15: Loaded plugins: rhnplugin, security

  16: This system is not registered with ULN.

  17: ULN support will be disabled.

  18: Setting up Install Process

  19: Resolving Dependencies

  20: --> Running transaction check

  21: ---> Package gcc.x86_64 0:4.1.2-51.el5 set to be updated

  22: --> Processing Dependency: glibc-devel >= 2.2.90-12 for package: gcc

  23: --> Running transaction check

  24: ---> Package glibc-devel.x86_64 0:2.5-65 set to be updated

  25: --> Processing Dependency: glibc-headers = 2.5-65 for package: glibc-devel

  26: --> Processing Dependency: glibc-headers for package: glibc-devel

  27: --> Running transaction check

  28: ---> Package glibc-headers.x86_64 0:2.5-65 set to be updated

  29: --> Processing Dependency: kernel-headers >= 2.2.1 for package: glibc-headers

  30: --> Processing Dependency: kernel-headers for package: glibc-headers

  31: --> Running transaction check

  32: ---> Package kernel-uek-headers.x86_64 0:2.6.32-200.13.1.el5uek set to be updated

  33: --> Finished Dependency Resolution

  34:  

  35: Dependencies Resolved

  36:  

  37: ====================================================================================================================================

  38:  Package                           Arch                  Version                                Repository                     Size

  39: ====================================================================================================================================

  40: Installing:

  41:  gcc                               x86_64                4.1.2-51.el5                           rhel-debuginfo                5.3 M

  42: Installing for dependencies:

  43:  glibc-devel                       x86_64                2.5-65                                 rhel-debuginfo                2.4 M

  44:  glibc-headers                     x86_64                2.5-65                                 rhel-debuginfo                594 k

  45:  kernel-uek-headers                x86_64                2.6.32-200.13.1.el5uek                 rhel-debuginfo                724 k

  46:  

  47: Transaction Summary

  48: ====================================================================================================================================

  49: Install       4 Package(s)

  50: Upgrade       0 Package(s)

  51:  

  52: Total download size: 9.0 M

  53: Is this ok [y/N]: y

  54: Downloading Packages:

  55: ------------------------------------------------------------------------------------------------------------------------------------

  56: Total                                                                                               2.6 GB/s | 9.0 MB     00:00     

  57: Running rpm_check_debug

  58: Running Transaction Test

  59: Finished Transaction Test

  60: Transaction Test Succeeded

  61: Running Transaction

  62:   Installing     : kernel-uek-headers                                                                                           1/4 

  63:   Installing     : glibc-headers                                                                                                2/4 

  64:   Installing     : glibc-devel                                                                                                  3/4 

  65:   Installing     : gcc                                                                                                          4/4 

  66:  

  67: Installed:

  68:   gcc.x86_64 0:4.1.2-51.el5                                                                                                         

  69:  

  70: Dependency Installed:

  71:   glibc-devel.x86_64 0:2.5-65        glibc-headers.x86_64 0:2.5-65        kernel-uek-headers.x86_64 0:2.6.32-200.13.1.el5uek       

  72:  

  73: Complete!

  74: [root@gsp yum.repos.d]# yum install gcc-c++

  75: Loaded plugins: rhnplugin, security

  76: This system is not registered with ULN.

  77: ULN support will be disabled.

  78: Setting up Install Process

  79: Resolving Dependencies

  80: --> Running transaction check

  81: ---> Package gcc-c++.x86_64 0:4.1.2-51.el5 set to be updated

  82: --> Processing Dependency: libstdc++-devel = 4.1.2-51.el5 for package: gcc-c++

  83: --> Running transaction check

  84: ---> Package libstdc++-devel.x86_64 0:4.1.2-51.el5 set to be updated

  85: rhel-debuginfo/filelists                                                                                     | 3.1 MB     00:00     

  86: --> Finished Dependency Resolution

  87:  

  88: Dependencies Resolved

  89:  

  90: ====================================================================================================================================

  91:  Package                           Arch                     Version                          Repository                        Size

  92: ====================================================================================================================================

  93: Installing:

  94:  gcc-c++                           x86_64                   4.1.2-51.el5                     rhel-debuginfo                   3.8 M

  95: Installing for dependencies:

  96:  libstdc++-devel                   x86_64                   4.1.2-51.el5                     rhel-debuginfo                   2.8 M

  97:  

  98: Transaction Summary

  99: ====================================================================================================================================

 100: Install       2 Package(s)

 101: Upgrade       0 Package(s)

 102:  

 103: Total download size: 6.6 M

 104: Is this ok [y/N]: y

 105: Downloading Packages:

 106: ------------------------------------------------------------------------------------------------------------------------------------

 107: Total                                                                                               3.5 GB/s | 6.6 MB     00:00     

 108: Running rpm_check_debug

 109: Running Transaction Test

 110: Finished Transaction Test

 111: Transaction Test Succeeded

 112: Running Transaction

 113:   Installing     : libstdc++-devel                                                                                              1/2 

 114:   Installing     : gcc-c++                                                                                                      2/2 

 115:  

 116: Installed:

 117:   gcc-c++.x86_64 0:4.1.2-51.el5                                                                                                     

 118:  

 119: Dependency Installed:

 120:   libstdc++-devel.x86_64 0:4.1.2-51.el5                                                                                             

 121:  

 122: Complete!

 123: [root@CEG-eSCM yum.repos.d]# 

 124:  

然后使用[root@gsp p7zip_9.20.1]# make && make install安装好p7zip后,使用7za x OracleLinuxandPataches.zip成功解压该zip压缩文件。

   1: [root@gsp tmp]# 7za x OracleLinuxandPataches.zip 

   2:  

   3: 7-Zip (A) [64] 9.20  Copyright (c) 1999-2010 Igor Pavlov  2010-11-18

   4: p7zip Version 9.20 (locale=en_US.UTF-8,Utf16=on,HugeFiles=on,2 CPUs)

   5:  

   6: Processing archive: OracleLinuxandPataches.zip

   7:  

   8: Extracting  Oracle Linux and Pataches

   9: Extracting  Oracle Linux and Pataches/OEL5.7_x85-64

  10: Extracting  Oracle Linux and Pataches/OEL5.7_x85-64/V27570-01.zip

  11: Extracting  Oracle Linux and Pataches/ora10gr2

  12: Extracting  Oracle Linux and Pataches/ora10gr2/10201_companion_linux_x86_64[1].cpio.gz

  13: Extracting  Oracle Linux and Pataches/ora10gr2/10201_database_linux_x86_64[1].cpio.gz

  14: Extracting  Oracle Linux and Pataches/ora10gr2/instruction.doc

  15: Extracting  Oracle Linux and Pataches/ora10gr2/p6810189_10204_Linux-x86-64.zip

  16: Extracting  Oracle Linux and Pataches/ora10gr2/p6810189_Oracle庐 Database Patch Set Notes.htm

  17: Extracting  Oracle Linux and Pataches/ora10gr2/p6810189_Oracle庐 Database Patch Set Notes_files

  18: Extracting  Oracle Linux and Pataches/ora10gr2/p6810189_Oracle庐 Database Patch Set Notes_files/oracle.gif

  19:  

  20: Everything is Ok

  21:  

  22: Folders: 4

  23: Files: 7

  24: Size:       6403564486

  25: Compressed: 6402832490

  26: [root@gsp tmp]# 

Linux下解压超过4G的zip文件的更多相关文章

  1. Linux环境下解压超过4GB的zip文件

    今天在Linux服务器中解压一个zip的压缩包,提示如下错误信息: [root@appsrv01 ZIP_BCSA_COURSES]# unzip BCSA_MEDIAS_BAK_20161118.z ...

  2. linux下解压被分割的zip文件

    形如被分割的一系列文件:linux.z01, linux.z02, linux.z03, linux.zip 直接右键解压是不行的. 首先合并文件:cat linux.* > linux_all ...

  3. linux下解压大于4G文件提示error: Zip file too big错误的解决办法

    error: Zip file too big (greater than 4294959102 bytes)错误解决办法.zip文件夹大于4GB,在centos下无法正常unzip,需要使用第三方工 ...

  4. Linux下解压rar格式的压缩文件

    如果需要在Linux系统下解压RAR格式的压缩包,需要安装Linux版本的rar程序. 具体安装步骤如下: wget http://www.rarlab.com/rar/rarlinux-3.8.0. ...

  5. linux解压分卷压缩的zip文件

    zip -s 0 records.zip --out 1.zip unzip 1.zip

  6. Linux下解压分包文件zip(zip/z01/z02)【转】

    本文转载自:https://www.cnblogs.com/EasonJim/p/7227109.html?utm_source=itdadao&utm_medium=referral Lin ...

  7. linux下解压zip文件

    linux下解压zip文件 linux自带的unzip命令可以解压windows下的zip格式的压缩文件. unzip命令 语法:unzip [选项] 压缩文件名.zip 各选项的含义分别为: -x ...

  8. linux下解压zip文件时,文件名乱码的解决(转载)

    转自:http://blog.sina.com.cn/s/blog_6261f8690101c1gx.html windows下的zip文件,在linux下解压时,经常会出现文件名乱码的情况. 主要原 ...

  9. linux cmd: linux下解压命令大全

    linux下解压命令大全 .tar 解包:tar xvf FileName.tar打包:tar cvf FileName.tar DirName(注:tar是打包,不是压缩!)———————————— ...

随机推荐

  1. spring整合hibernate的详细步骤

    Spring整合hibernate需要整合些什么? 由IOC容器来生成hibernate的sessionFactory. 让hibernate使用spring的声明式事务 整合步骤: 加入hibern ...

  2. struts2学习笔记--总结获取servletAPI的几种方式

    struts2的Action放弃了request,response等ServletAPI,使得在业务层上更加独立,在有时候使用struts2进行Web开发的时候,不可避免的要在action中使用ser ...

  3. C#异常处理的几个原则

    转载来自:http://www.oecp.cn/hi/LiuBP/blog/2312 在开发应用程序的时候,异常处理是非常的重要的,我找到一些异常处理准则,将它共享出来,如有不同意见,欢迎提出来一起探 ...

  4. PHP之时间处理

    面试的时候有一道题是这样的:封装一个函数实现,给你一个时间,输出这个时间的对应的这一天是星期几,其实无非就是一些时间格式的处理: date_default_timezone_set('PRC'); / ...

  5. Moon.Orm版本维护及下载(跟踪报道)

    提示:最下面有最新的下载地址  历史记录: ).-- :: 支持Mysql,Sqlserver(点击下载) ).2013年9月14日,代码重构,加入oracle.复合主键功能(点击下载) )--,为d ...

  6. Elasticsearch 全教程

    Elasticsearch 权威指南 在线阅读 国外自动指向 GITBOOK 项目 | 国内用户自动指向 阿里云 GITHUB 仓库 译者前言 译者现在的工作项目中需要用到 Elasticsearch ...

  7. ubuntu 解决 “E: Problem with MergeList /var/lib/apt/lists/”错误

    这种错误的意思:无法解析或打开软件包的列表或是状态文件. 出现的原因:无法解析或打开软件包列表多数情况是安装的软件与本身系统有一些冲突之类的问题,或者曾在更新软件源或下载软件的时候意外中断造成的. 解 ...

  8. Xamarin.Android之引导页的简单制作

    0x01 前言 对于现在大部分的APP,第一次打开刚安装或更新安装的APP都会有几个引导界面,通常这几个引导页是告诉用户 APP有些什么功能或者修改了什么bug.新增了什么功能等等等. 下面就用Xam ...

  9. globalization与全球化

    本配置节是关于配置应用程序的全球化设置. <globalization <!--以下两个特性默认编码为 UTF-8,该编码在 Machine.config 文件(在安装 .NET Fram ...

  10. 【Java每日一题】20161221

    package Dec2016; public class Ques1221 { } class Parent{ public void test(){ System.out.println(&quo ...