xcode-select: error: tool 'xcodebuild' requires Xcode, but active developer directory '/Library/Developer/CommandLineTools' is a command line tools instance
运行xcode命令报错:
sh-3.2# xcodebuild
xcode-select: error: tool 'xcodebuild' requires Xcode, but active developer directory '/Library/Developer/CommandLineTools' is a command line tools instanc
直接百度错误提示信息找这篇贴子
博主找到的原因是:
升级Xcode后,不是系统默认位置。我想我是直接安装最新版的xcode应该也是这样的问题。

解决的办法是:
修改xcode指向的目录
xcode-select -s /Applications/Xcode.app/Contents/Developer
再次执行xcodebuild就可以正确执行了
1 sh-3.2# xcodebuild
2 note: Using new build system
3 note: Planning build
4 note: Constructing build description
5 Build system information
6 error: Signing for "HelloWorld" requires a development team. Select a development team in the project editor. (in target 'HelloWorld')
7
8 ** BUILD FAILED **
我这边build failed是因为还没有配置开发者账号
by the way 查看xcode安装目录的命令:
这是在未修改xcode命令指向新目录前,是系统默认的位置
sh-3.2# xcode-select --print-path
/Library/Developer/CommandLineTools
这是修改后,再次查看,xcode命令指向xcode的安装目录已经变了
sh-3.2# xcode-select --print-path
/Applications/Xcode.app/Contents/Developer
xcode-select: error: tool 'xcodebuild' requires Xcode, but active developer directory '/Library/Developer/CommandLineTools' is a command line tools instance的更多相关文章
- Xcode - xcode-select: error: tool 'xcodebuild' requires Xcode报错解决方案
用mac 自带的终端执行的命令,安装安装Vapor和toolbox 安装指令: macdeMacBook-Pro:~ mac$ curl -sL check.vapor.sh| bash 结果报这个错 ...
- ios 自动化构建 code-select: error: tool 'xcodebuild' requires Xcode, but active developer directory.....
问题描述: Pod installation complete! There are 2 dependencies from the Podfile and 3 total pods installe ...
- stderr: xcode-select: error: tool 'xcodebuild' requires Xcode, but active developer directory '/Library/Developer/CommandLineTools' is a command line tools instance
错误提示: (1). stderr: xcode-select: error: tool 'xcodebuild' requires Xcode, but active developer direc ...
- Mac Angular打包报错xcode-select: error: tool 'xcodebuild' requires Xcode
Mac Angular打包报错: Error: xcode-select: error: tool 'xcodebuild' requires Xcode, but active developer ...
- Mac下idea启动H5报错:xcode-select: error: tool 'xcodebuild' requires Xcode, but active developer directory '/Library/Deve
1. 执行“ xcodebuild -showsdks ”,报错如下“xcode-select: error: tool 'xcodebuild' requires Xcode, but active ...
- iOS自动化构建 xcode-select: error: tool 'xcodebuild' requires Xcode, but active developer directory '/Library/D...
报这个错误的原因是xcode-select不在默认的路径 1.找到xcode-select的当前路径终端命令行 xcode-select --print-path /Library/Developer ...
- tool 'xcodebuild' requires Xcode, but active developer directory '/Library/Developer/CommandLineTools' is a command line tools instance
在执行自动化打包的时候报错,检查发现是Xcode的路径被改了 标记3的地方原来默认是没有内容的,点击它,然后会自动弹出一个选项,就是xcode的版本. 修改后,在命令行输入xcodebuild命令测试 ...
- xcode-select: error: tool 'xcodebuild' requires Xcode, but active developer directory '/Library/Deve
以上错误是因为安装了 xcode , 但并不是系统默认的位置, 所以可以使用以下命令把 xcode 的路径修改为你安装的位置即可 sudo xcode-select --switch /Applica ...
- 关于 ReactNative 环境搭建之 error: invalid developer directory '/Library/Developer/CommandLineTools' - RN
简要说明,此次尝试安装 ReactNative 时当前 MacPro 版本为 10.13.6.Xcode 版本为 Version 9.4.1 (9F2000),按照官方的完整原生环境搭建流程一步步执行 ...
随机推荐
- oracle函数与存储方法
oracle中的函数, 可以理解为java中的方法 有参数, 或者没有参数 通过return返回一个值 oracle存储过程跟函数唯一的区别, 存储过程不能通过return返回一个值 参数的类型, i ...
- Chrome打开标签页预览
类似于Microsoft Edge浏览器上的标签页缩略图预览非常方便,其实现在谷歌浏览器正在测试相关的功能,如果想提前体验,就在地址栏输入"chrome://flags"并按下回车 ...
- ubuntu18.04 安装 jdk
1.当前路径(如果不想下载到当前路径,可以先cd到指定路径,再开始下载),官网下载JDK文件jdk-8u121-linux-x64.tar.gz $ wget https://download.ora ...
- 59-python基础-python3-集合-集合常用方法-判断一个集合是否是另一个集合的子集-issubset()-issuperset()
判断一个集合是否是另一个集合的子集-issubset()-issuperset() 1-issubset() s1.issubset(s) 判断s1是否是s的子集 2-issuperset() 与is ...
- Metasploitable2使用指南
Metasploitable2使用指南 Metasploitable2 虚拟系统是一个特别制作的ubuntu操作系统,本身设计作为安全工具测试和演示常见漏洞攻击.版本2已经可以下载,并且比上一个版本包 ...
- Ajax ——数据解析
Ajax应用中数据解析是非常重要的一件事情.一般服务器返回数据有三种格式:txt , xml, json 1.解析txt 当服务器返回的数据为字符串,则这种Ajax数据 ...
- 【ASE高级软件工程】Alpha 阶段 backend组 scrum1 记录
本次会议于11月4日,19:10 在微软北京西二号楼13478召开,持续40分钟. 与会人员:Haifeng Chen, Zhikai Chen, Hao Wang, Jia Ning 请假: Xin ...
- vsftpd.service: Main process exited, code=exited, status=2/INVALIDARGUMENT和vsftpd:500 OOPS: vsftpd: refusing to run with writable root inside chroot ()错误的解决方法
今天在配置VSFTPD过程中遇到两个错误 1是启动失败,通过 SERVICE VSFTPD STATUS 查看到报错 May 02 16:06:58 debian systemd[1]: Starti ...
- Sass--混合宏--声明宏
如果你的整个网站中有几处小样式类似,比如颜色,字体等,在 Sass 可以使用变量来统一处理,那么这种选择还是不错的.但当你的样式变得越来越复杂,需要重复使用大段的样式时,使用变量就无法达到我们目了.这 ...
- 阿里腾讯校招Java面试题总结及答案
阿里校招java面试题汇总 1.HashMap和HashTable的区别,及其实现原理. Hashtable继承自Dictionary类,而HashMap是Java1.2引进的,继承自Abstract ...