fatal error C1003: error count exceeds number; stopping compilation解决方法
【error】C1003: error count exceeds 100; stopping compilation ...winnt.h
在项目工程中添加#include<windows.h>之后出现如下问题:
Error 110 error C1003: error count exceeds 100; stopping compilation C:\Program Files (x86)\Microsoft SDKs\Windows\v7.0A\include\winnt.h 13550
解决方法修改工程属性中C++语言一个地方即可:Configuration Propterties -> C/C++ -> Language -> Disable Language Extensions: 由 Yes(/Za) 改为 No.

解决方法修改工程属性中C++语言一个地方即可:Configuration Propterties -> C/C++ -> Language -> Disable Language Extensions: 由 Yes(/Za) 改为 No.

---------------------
fatal error C1003: error count exceeds number; stopping compilation解决方法的更多相关文章
- Ubuntu下 fatal error: Python.h: No such file or directory 解决方法
参考: fatal error: Python.h: No such file or directory Ubuntu下 fatal error: Python.h: No such file or ...
- “fatal error: hdf5.h: 没有那个文件或目录”解决方法
問題一: Installing Caffe without CUDA: fatal error: cublas_v2.h No such file: 在Makefile.config中修改,將CPU_ ...
- git rebase与 git合并(error: failed to push some refs to)解决方法
1.遇到的问题 本地有一个git仓库,在github上新建了一个空的仓库,但是更新了REWADME.md的信息,即在github上多了一个提交. 关联远程仓库,操作顺序如下: git remote a ...
- Hadoop Error:Name node is in safe mode的解决方法
Error:name node is in safe mode 解决方法:hadoop dfsadmin -safemode leave(见图)
- error at ::0 can't find referenced pointcut...解决方法
error at ::0 can't find referenced pointcut...解决方法 学习了:http://dyldragon.iteye.com/blog/512612 升级aspe ...
- 输入指令npx webpack-dev-server报错:Error: Cannot find module ‘webpack-cli/bin/config-yargs‘的解决方法
输入指令npx webpack-dev-server报错:Error: Cannot find module 'webpack-cli/bin/config-yargs'的解决方法 输入指令:npx ...
- 编译boost程序出现如下错误fatal error LNK1104: cannot open file 'libboost_system-vc100-mt-gd-1_54.lib'的解决方法
对于如下程序: #include <iostream> #include <boost/asio.hpp> #include <boost/date_time/posix ...
- error LNK2019: 无法解析的外部符号(编程解决方法)
正在编译...1>Ipv4IPv6traceroutesrc.cpp1>d:\研究生\c++\study\test\test\ipv4ipv6traceroutesrc.cpp(461) ...
- Eclipse启动时发生An internal error occurred during: "Initializing Java Tooling".错误的解决方法
问题描述: Eclipse启动时发生An internal error occurred during: "Initializing JavaTooling".错误的解决方法 解决 ...
随机推荐
- js 回调函数小例子
js 回调函数小例子 <script> //将函数作为另一个函数的参数 function test1(){ alert("我是test1"); } function t ...
- tflearn中一些CNN RNN的例子
lstm.py # -*- coding: utf-8 -*- """ Simple example using LSTM recurrent neural networ ...
- 什么是EL表达式
转自:https://blog.csdn.net/hj7jay/article/details/51302466 1. EL表达式主要作用 EL表达式说白了,就是让JSP写起来更加方便,它属于JSP技 ...
- 基于macOS+VMware的GNS3内VM上公网
笔者经常需要做网络实验,GNS3就是笔者最喜欢用的模拟器,为了便于实验,需要能从macos上直接ssh登陆模拟出来的vm,并且vm需要上公网.经过研究,已解决此问题,并以此分享出来 tag: maco ...
- SQL Server 日常维护--查询当前正在执行的语句、死锁、堵塞
查询当前正在执行的语句: SELECT der.[session_id],der.[blocking_session_id], sp.lastwaittype,sp.hostname,sp.progr ...
- Linux下安装 php-memcache 扩展
需要的库:yum install -y libmemcached libmemcached-devel 下载:https://pecl.php.net/package/memcached 安装: un ...
- surface 更新提示
- (转)Django学习之 第三章:动态Web页面基础
上一章我们解释了怎样开始一个Django项目和运行Django服务器 当然了,这个站点实际上什么也没有做------除了显示了"It worked"这条信息以外. 这一章我们介绍怎 ...
- Android ListView getView()方法重复调用导致position错位
问题现状:Android ListView getView()方法重复调用导致position错位 解决办法:把ListView布局文件的layout_height属性改为fill_parent或者m ...
- Book 树状数组 小结
差不多花了10天学树状数组,是照着这篇博客做的题目,还差几道---------- http://blog.csdn.net/chenguolinblog/article/details/9916229 ...