编译gd-2.0.35.tar.gz时报错:gd_png.c:16:53: error: png.h: No such file or directory
编译gd-2.0.35.tar.gz时报错:
gcc -DHAVE_CONFIG_H -I. -I. -I. -I/usr/local/freetype/include/freetype2 -I/usr/local/freetype/include -I/usr/local/freetype/include -I/usr/local/jpeg/include -g -O2 -MT gd_png.lo -MD -MP -MF .deps/gd_png.Tpo -c gd_png.c -fPIC -DPIC -o .libs/gd_png.o gd_png.c:16:53: error: png.h: No such file or directory gd_png.c:47: error: expected specifier-qualifier-list before ‘jmp_buf’ gd_png.c:54: error: expected ‘)’ before ‘png_ptr’ gd_png.c:82: error: expected ‘)’ before ‘png_ptr’ gd_png.c:92: error: expected ‘)’ before ‘png_ptr’
解决办法:
vi gd_png.c 将 #include “png.h” 替换成: #include “/usr/local/libpng/include/png.h” 然后再make就可以了
注:include“”双引号里包含的是libpng安装的路径里的include文件夹里的png.h文件
转自:http://hi.baidu.com/wainqaidcz/blog/item/bfc5fa53749356481138c277.html
编译gd-2.0.35.tar.gz时报错:gd_png.c:16:53: error: png.h: No such file or directory的更多相关文章
- Centos 7.5源码编译安装zabbix4.0报fatal error: mysql.h: No such file or directory
系统环境:CentOS 7.5是最小化安装的 编译信息 编译选项: root@Server01 zabbix-]# ./configure --prefix=/usr/share/applicatio ...
- caffe编译问题-src/caffe/net.cpp:8:18: fatal error: hdf5.h: No such file or directory compilation terminated.
错误描述 src/caffe/net.:: fatal error: hdf5.h: No such : recipe 操作过程 step1: 在Makefile.config文件更改INCLUDE_ ...
- /usr/include/glib-2.0/glib/gtypes.h:34:24: fatal error: glibconfig.h: No such file or directory
cc -DDEBUG -mtune=core2 -O2 \ -onvideo nvideo.c \ -I/usr/include/atk-1.0 \ -I/usr/include/cairo \ -I ...
- Linux下编译安装mysql-5.0.45.tar.gz
安装环境:VMware9(桥接模式) + Linux bogon 2.6.32-642.3.1.el6.x86_64(查看linux版本信息:uname -a) 先给出MySQL For Linux ...
- 编译openwrt时报错build_dir/hostpkg/libubox-2018-07-25-c83a84af/blobmsg_json.c:21:19: fatal error: json.h: No such file or directory
答: 一. 详细日志: build_dir/hostpkg/libubox-2018-07-25-c83a84af/blobmsg_json.c:21:19: fatal error: json.h: ...
- 编译boost python模块遇到的错误:../../libraries/boost_1_44_0/boost/python/detail/wrap_python.hpp:75:24: fatal error: patchlevel.h: No such file or directory
就是遇到类似标题上面的错误. 原因是没有安装对应python的python-dev依赖,不然编译到boost python模块的时候就会出错. 所以解决方案是sudo apt-get install ...
- [转]pro*c/c++编译错误 ” error: sqlca.h: No such file or directory “ 的解决办法
$ gcc -o test test.c 出现错误:error: sqlca.h: No such file or directory [解决方法]知道 sqlca.h 在 $ORACLE_HOME/ ...
- tesseract编译错误:fatal error: allheaders.h: No such file or directory
错误描述: globaloc.cpp::: fatal error: allheaders.h: No such file or directory #include "allheaders ...
- Mac OS X 编译android内核 error: elf.h: No such file or directory 的解决方法
1. 从网上下个elf.h放到scripts/mod/文件夹(http://www.rockbox.org/tracker/9006?getfile=16683) 2. 修改两个文件mk_elfcon ...
随机推荐
- linux磁盘简单分区方式
1:分区 fdisk /dev/sdb 2:格式化 mkfs -t ext3 /dev/sdb1 或者 mke2fs -t ext4 /dev/sdb2 3:挂载 mount /dev/sdb1 ...
- hdoj 1402 Prepared for New Acmer【快速幂】
Prepared for New Acmer Time Limit: 2000/1000 MS (Java/Others) Memory Limit: 65536/32768 K (Java/O ...
- [OC Foundation框架 - 12] NSNumber
1.概念 NSArray,NSDictionary只能放OC对象,不能放入基本数据类型 必须使用包装类NSNumber,把基本数据类型包装成OC对象 不支持自动包装解包 void number() ...
- Bugs及解决方案列表
Bugs及解决方案列表(以下实例默认运行环境都为Standard mode): 如何在IE6及更早浏览器中定义小高度的容器? 方法: #test{overflow:hidden;height:1px; ...
- input输入密码变黑点密文
input输入密码加密 html代码 <form id="login-form" method="post" onsubmit="return ...
- Android 命名规范和编码规范
简明概要 多写注释 一.关于命名规范 对于开发项目来说肯定是要有统一的规范,然而命名规范需要做到哪几点呢? 答: 首先,不能反人类. 再来就是,要望文而知其意. 下面就来说说具体该怎么去规范我们的代 ...
- 利用openssl进行BASE64编码解码、md5/sha1摘要、AES/DES3加密解密
国内私募机构九鼎控股打造APP,来就送 20元现金领取地址:http://jdb.jiudingcapital.com/phone.html内部邀请码:C8E245J (不写邀请码,没有现金送)国内私 ...
- cocos2d-x 精灵遮罩
转自:http://bbs.9ria.com/thread-220210-1-4.html 首先得理解一些东西. 1.理解颜色混合.精灵有个成员函数:setBlendFunc(),这个函数以一个ccB ...
- stap-prep 需要安装那些内核符号
[root@server-mysql ~]# Need to install the following packages:kernel-debuginfo-2.6.32-279.el6.x86_64 ...
- node.js 浏览器中输出 “hello world”
前段时间花了几个小时,在command面板输出了“hello world”,今天就来说说怎么在浏览器上输入一个地址,然后页面输出“hello world”. 首先要搭建一个基础的 HTTP 服务器 一 ...