Caused by: org.apache.velocity.exception.MethodInvocationException: Invocation of method 'getUser' in class org.uncommons.reportng.ReportMetadata threw exception class java.net.UnknownHostException :
Running TestSuite
[TestNG] [WARN] Ignoring duplicate listener : org.uncommons.reportng.HTMLReporter
[TestNG] [WARN] Ignoring duplicate listener : org.uncommons.reportng.JUnitXMLReporter
[INFO ] 2019-04-21 18:26:24,609 method:com.chen.autocases.TestDemo.testcase1(TestDemo.java:10)
testcase1
[TestNG] Reporter org.uncommons.reportng.HTMLReporter@1e7bba3 failed
org.uncommons.reportng.ReportNGException: Failed generating HTML report.
at org.uncommons.reportng.HTMLReporter.generateReport(HTMLReporter.java:122)
at org.testng.TestNG.generateReports(TestNG.java:1097)
at org.testng.TestNG.run(TestNG.java:1022)
at org.apache.maven.surefire.testng.TestNGExecutor.run(TestNGExecutor.java:170)
at org.apache.maven.surefire.testng.TestNGXmlTestSuite.execute(TestNGXmlTestSuite.java:84)
at org.apache.maven.surefire.testng.TestNGProvider.invoke(TestNGProvider.java:92)
at sun.reflect.NativeMethodAccessorImpl.invoke0(Native Method)
at sun.reflect.NativeMethodAccessorImpl.invoke(NativeMethodAccessorImpl.java:62)
at sun.reflect.DelegatingMethodAccessorImpl.invoke(DelegatingMethodAccessorImpl.java:43)
at java.lang.reflect.Method.invoke(Method.java:498)
at org.apache.maven.surefire.util.ReflectionUtils.invokeMethodWithArray2(ReflectionUtils.java:208)
at org.apache.maven.surefire.booter.ProviderFactory$ProviderProxy.invoke(ProviderFactory.java:156)
at org.apache.maven.surefire.booter.ProviderFactory.invokeProvider(ProviderFactory.java:82)
at org.apache.maven.plugin.surefire.InPluginVMSurefireStarter.runSuitesInProcess(InPluginVMSurefireStarter.java:82)
at org.apache.maven.plugin.surefire.AbstractSurefireMojo.executeProvider(AbstractSurefireMojo.java:867)
at org.apache.maven.plugin.surefire.AbstractSurefireMojo.executeAfterPreconditionsChecked(AbstractSurefireMojo.java:747)
at org.apache.maven.plugin.surefire.AbstractSurefireMojo.execute(AbstractSurefireMojo.java:645)
at org.apache.maven.plugin.DefaultBuildPluginManager.executeMojo(DefaultBuildPluginManager.java:106)
at org.apache.maven.lifecycle.internal.MojoExecutor.execute(MojoExecutor.java:208)
at org.apache.maven.lifecycle.internal.MojoExecutor.execute(MojoExecutor.java:153)
at org.apache.maven.lifecycle.internal.MojoExecutor.execute(MojoExecutor.java:145)
at org.apache.maven.lifecycle.internal.LifecycleModuleBuilder.buildProject(LifecycleModuleBuilder.java:84)
at org.apache.maven.lifecycle.internal.LifecycleModuleBuilder.buildProject(LifecycleModuleBuilder.java:59)
at org.apache.maven.lifecycle.internal.LifecycleStarter.singleThreadedBuild(LifecycleStarter.java:183)
at org.apache.maven.lifecycle.internal.LifecycleStarter.execute(LifecycleStarter.java:161)
at org.apache.maven.DefaultMaven.doExecute(DefaultMaven.java:318)
at org.apache.maven.DefaultMaven.execute(DefaultMaven.java:153)
at org.jvnet.hudson.maven3.launcher.Maven31Launcher.main(Maven31Launcher.java:132)
at sun.reflect.NativeMethodAccessorImpl.invoke0(Native Method)
at sun.reflect.NativeMethodAccessorImpl.invoke(NativeMethodAccessorImpl.java:62)
at sun.reflect.DelegatingMethodAccessorImpl.invoke(DelegatingMethodAccessorImpl.java:43)
at java.lang.reflect.Method.invoke(Method.java:498)
at org.codehaus.plexus.classworlds.launcher.Launcher.launchStandard(Launcher.java:331)
at org.codehaus.plexus.classworlds.launcher.Launcher.launch(Launcher.java:239)
at jenkins.maven3.agent.Maven31Main.launch(Maven31Main.java:185)
at sun.reflect.NativeMethodAccessorImpl.invoke0(Native Method)
at sun.reflect.NativeMethodAccessorImpl.invoke(NativeMethodAccessorImpl.java:62)
at sun.reflect.DelegatingMethodAccessorImpl.invoke(DelegatingMethodAccessorImpl.java:43)
at java.lang.reflect.Method.invoke(Method.java:498)
at hudson.maven.Maven3Builder.call(Maven3Builder.java:139)
at hudson.maven.Maven3Builder.call(Maven3Builder.java:70)
at hudson.remoting.UserRequest.perform(UserRequest.java:181)
at hudson.remoting.UserRequest.perform(UserRequest.java:52)
at hudson.remoting.Request$2.run(Request.java:336)
at hudson.remoting.InterceptingExecutorService$1.call(InterceptingExecutorService.java:68)
at java.util.concurrent.FutureTask.run(FutureTask.java:266)
at java.util.concurrent.ThreadPoolExecutor.runWorker(ThreadPoolExecutor.java:1149)
at java.util.concurrent.ThreadPoolExecutor$Worker.run(ThreadPoolExecutor.java:624)
at java.lang.Thread.run(Thread.java:748)
Caused by: org.apache.velocity.exception.MethodInvocationException: Invocation of method 'getUser' in class org.uncommons.reportng.ReportMetadata threw exception class java.net.UnknownHostException : bogon: bogon: Temporary failure in name resolution
at org.apache.velocity.runtime.parser.node.ASTIdentifier.execute(ASTIdentifier.java:193)
at org.apache.velocity.runtime.parser.node.ASTReference.execute(ASTReference.java:175)
at org.apache.velocity.runtime.parser.node.ASTReference.render(ASTReference.java:220)
at org.apache.velocity.runtime.parser.node.SimpleNode.render(SimpleNode.java:230)
at org.apache.velocity.Template.merge(Template.java:256)
at org.apache.velocity.app.Velocity.mergeTemplate(Velocity.java:449)
at org.uncommons.reportng.AbstractReporter.generateFile(AbstractReporter.java:108)
at org.uncommons.reportng.HTMLReporter.createOverview(HTMLReporter.java:148)
at org.uncommons.reportng.HTMLReporter.generateReport(HTMLReporter.java:111)
... 48 more
Tests run: 2, Failures: 1, Errors: 0, Skipped: 0, Time elapsed: 15.332 sec <<< FAILURE! - in TestSuite
testcase1(com.chen.autocases.TestDemo) Time elapsed: 0.01 sec <<< FAILURE!
java.lang.AssertionError: expected [true] but found [false]
解决方法:

[root@bogon secrets]# hostname
bogon
解决方法:
1 执行hostname命令
可以看出 ping 不通我们的hostname 这就是原因所在
2 修改 /etc/sysconfig/network
改成我们的hostname命令下的名字
3 修改 /etc/hosts内容
加上我们的hostname命令下的名字
4 最后执行 /etc/rc.d/init.d/network rest
Caused by: org.apache.velocity.exception.MethodInvocationException: Invocation of method 'getUser' in class org.uncommons.reportng.ReportMetadata threw exception class java.net.UnknownHostException :的更多相关文章
- velecity报错:Caused by: org.apache.velocity.exception.ParseErrorException: Lexical error, Encountered: <EOF> after : "\'/order/pay?activity=\" + activityId);\r\n }*/\r\n</script>\r\n#end\r\n" at /a
Caused by: org.apache.velocity.exception.ParseErrorException: Lexical error, Encountered: <EOF> ...
- org.springframework.beans.MethodInvocationException: Property 'cacheManager' threw exception; nested exception is org.apache.shiro.cache.CacheException: net.sf.ehcache.CacheException: Caches cannot be
shiro cache manage配置报错: org.springframework.beans.MethodInvocationException: Property 'cacheManager' ...
- 遇到的错误之"Exception in thread “main“ java.lang.NoClassDefFoundError: org/apache/velocity/context/Context at"
问题 Exception in thread "main" java.lang.NoClassDefFoundError: org/apache/velocity/context/ ...
- ?--Porg.springframework.beans.MethodInvocationException: Property 'username' threw exception; nested exception is java.lang.NullPointerException
使用BoneCP作为连接池,在启动Tomcat报出以下异常: 一月 02, 2016 2:12:17 下午 org.apache.tomcat.util.digester.SetPropertiesR ...
- Caused by: org.apache.ibatis.exceptions.TooManyResultsException: Expected one result (or null) to be returned by selectOne(), but found: 2
异常信息 Caused by: org.springframework.beans.factory.BeanCreationException: Error creating bean with na ...
- 《Apache Velocity用户指南》官方文档
http://ifeve.com/apache-velocity-dev/ <Apache Velocity用户指南>官方文档 原文链接 译文连接 译者:小村长 校对:方腾飞 Qui ...
- Caused by: org.apache.ibatis.reflection.ReflectionException: There is no getter for property named 'company' in 'class java.lang.String'
Caused by: org.apache.ibatis.reflection.ReflectionException: There is no getter for property named ' ...
- Caused by: org.apache.ibatis.binding.BindingException: Parameter 'parameter' not found.解决
Caused by: org.apache.ibatis.binding.BindingException: Parameter 'company' not found. Available para ...
- spring和mybatis整合报错:org.springframework.beans.MethodInvocationException: Property 'dataSource' threw exception; nested exception is java.lang.NoClassDefFoundError
Exception in thread "main" org.springframework.beans.factory.UnsatisfiedDependencyExceptio ...
随机推荐
- 通过ifrmae异步下载文档
//通过ifrmae异步下载文档 function iframeGetFile(opts) { var defaultOpts = { filePath: '', onload: function ( ...
- [WEB地图] 2017高德地图API WEB开发(key申请,地图搭建)简约教程
前端时间因为公司需要研究 了一下百度的教程 然后写个简约的笔记记录一下自己学习的收获,只为了满足自己暂时的写作热情 高德地图WEB开发(key申请.api)简约教程 1.首先我们需要去“高德地 ...
- 强网杯2018 pwn复现
前言 本文对强网杯 中除了 2 个内核题以外的 6 个 pwn 题的利用方式进行记录.题目真心不错 程序和 exp: https://gitee.com/hac425/blog_data/blob/m ...
- UnicodeEncodeError: 'ascii' codec can't encode characters in position 2-5: ordin al not in range(128)——解决方案备注
在vim中使用ycm插件时,偶尔会出现: “UnicodeEncodeError: 'ascii' codec can't encode characters in position 2-5: ord ...
- DDL为什么不能rollback?
转自 http://blog.csdn.net/dba_waterbin/article/details/8621367 在Oracle中DDL语句将转化为对数据字典表的DML语句:比如,一个简单的修 ...
- 通过ES6实现的Ajax类
个人学习用途而已,仅供参考. class Ajax { constructor(xhr) { xhr = window.XMLHttpRequest ? new XMLHttpRequest() : ...
- ReactJS表单handleChange
handleInputChange = (event) => { const target = event.target; const type = target.type; const val ...
- leetCode题解之Jewels and Stones
1.题目描述 2.分析 使用HashTable 是解决这种的好方法. 3.代码 int numJewelsInStones(string J, string S) { map<char,int& ...
- ubuntu 下 mysql数据库的搭建 及 数据迁移
1.mysql的安装 我是使用apt-get直接安装的 :sudo apt-get install mysql-server sudo apt-get install mysql-client 2.配 ...
- django简介及URL
Django流程图 Django Urls 引自:http://www.cnblogs.com/alex3714/articles/5457672.html