jz2440不能成功地启动文件系统, Failed to execute /linuxrc.
文件系统加载失败,错误信息提示:
VFS: Mounted root (nfs filesystem).
Freeing init memory: 140K
Failed to execute /linuxrc. Attempting defaults...
Kernel panic - not syncing: No init found. Try passing init= option to kernel.
1. jz2440不能成功地从nfs启动文件系统.
芯片的型号:K9F2G08U0C
芯片大小:256M Byte记忆单元阵列:(256M + 8,192K)bit x 8bit
2048 blocks * 64 pages/block * 2048 bytes/page = [256M Bytes]
这个芯片的写操作是以页为单位的,擦除是以块为单位的.
擦出页面的起始地址以及偏移量应该是2048*64的整数倍.
原因:
不能执行linuxrc,是因为在创建lib下的动态库时,里面只有软连接,没有软连接实体
解决办法:
把软连接的对应的实体拷到lib下
2. jz2440不能成功地从nandflash启动文件系统.
原因:烧写yaffs的时候用错了指令, 烧写yaffs的时候应该用
nand write.yaffs 30000000 260000
ram_addr nand_offset file_size
file_size必须等于刚好传送的文件大小.
附制作和烧写yaffs过程:
mkyaffs2image /home/jz2440/nfs_root/fs_ocean /home/jz2440/nfs_root/fs_ocean.yaffs2 tftp 30000000 fs_ocean.yaffs2;
nand erase root;
nand write.yaffs 30000000 260000 474900; //这里474900一定是tftp传输实际的文件字节大小, 这是烧写yaffs文件必须的格式.
jz2440不能成功地启动文件系统, Failed to execute /linuxrc.的更多相关文章
- NFS启动文件系统
NFS启动文件系统 一.软硬件平台 1.开发板:创龙AM3359核心板,网口采用RMII形式. 2.UBOOT版本:U-Boot-2016.05,采用FDT和DM. 3.交换芯片MARVELL的88E ...
- [ERROR] Failed to execute goal org.apache.maven.plugins:maven-war-plugin:2.1.1:war
创建springboot项目,且不采用<parent>引入springboot时,pom.xml如下: <?xml version="1.0" encoding= ...
- Failed to execute request because the App-Domain could not be created.
原错误信息: 服务器应用程序不可用 您试图在此 Web 服务器上访问的 Web 应用程序当前不可用.请点击 Web 浏览器中的“刷新”按钮重试您的请求. 管理员注意事项: 详述此特定请求失败原因的错误 ...
- Failed to execute command: ""C:\Program Files (x86)\Microsoft SDKs\Windows\v7.0A\Bin\ResGen.exe" 的一个解决办法
最近在做wpf项目,期间下了一些源码参考,但是在build时经常遇到下面这种bug: Error 2 Failed to execute command: ""C:\Program ...
- Maven创建项目: Failed to execute goal org.apache.maven.plugin( mvn archetype:create)
一.概述: 在使用mvn 命令mvn archetype:create -DgroupId=com.chuanliu.c11 -DartifactId=c11searcher在控制创建maven项目和 ...
- [ERROR] Failed to execute goal org.apache.maven.plugins:maven-compiler-plugin:3.2:compile (default-compile) on project taotao-manager-pojo: Compilation failure
运行maven项目时报错 [ERROR] Failed to execute goal org.apache.maven.plugins:maven-compiler-plugin:3.2:compi ...
- Failed to execute goal org.apache.maven.plugins:maven-clean-plugin:2.5:clean (default-
Maven项目报错:Failed to execute goal org.apache.maven.plugins:maven-clean-plugin:2.5:clean (default-clea ...
- Failed to execute goal org.apache.tomcat.maven:tomcat7-maven-plugin:2.2:deploy (default-cli) on project Resource: Cannot invoke Tomcat manager: Connection refused: connect -> [Help 1]
1.问题描述 在 DOS 下执行 tomcat7-maven-plugin 插件部署,启动 Apache Tomcat 服务报错如下: D:\2018\code\XXX>mvn tomcat7: ...
- Failed to execute 'write' on 'Document'动态载入的js不能执行write
统计代码一般都是直接一个标签,插入js,标签放在哪里,统计图表就放在哪里! 我现在是稍微改了一下,我自己加了一点js,在页面所有元素都加载完成之后我再动态的把统计js插入到我需要的地方. 统计代码的s ...
随机推荐
- Linux 安装g++
g++ 它的全名不叫g++而是叫gcc-c++; 所以要安装它就可以用 yum install gcc-c++;
- MYSQL 执行计划
Explain语法 EXPLAIN SELECT …… 变体: 1. EXPLAIN EXTENDED SELECT …… 将执行计划“反编译”成SELECT语句,运行SHOW WARNINGS 可得 ...
- HDU 5059 Help him
题解:先判断第一个是否负号.如果是把第一个符号拿掉之后判断后面的长度是否<=12,并且是否数字,然后转化成数字看看是否在[a,b],注意-0这个数据. 如果不是判断长度是否<=12,并且是 ...
- [Ext JS 4] 布局之实战一 - 中间区块不会自动伸展 (tab)
前言 [Ext JS 4] 布局之实战一 - 中间区块不会自动伸展 (tab) 在上一篇中,中间的tab 区块无法自动伸展的原因一句话说就是: 使用contentEL的方式,相关HTML元素不会参与组 ...
- Linq to Sqlite连接
本人还是挺喜欢用Sqlite,鼓捣半天终于连上了,赶紧记录一下 1.当然还是新建一个项目,还是winform, 2.Vs2012添加NoGet,点击工具--扩展和更新,搜索NoGet,安装. 3.管理 ...
- jade初学
jade是一个比ejs略难得模板.express的默认模本就是jade. 今天看了一下其实不是太难~~ 笔记: jade中使用缩进来定义HTML文档的层次结构 jade不需要关闭标签 给div添加id ...
- ExtJs005继承
Ext.onReady(function () { //extend 继承 Ext.define('Person', { config: { name: 'aaa' }, //给当前定义的类加一个构造 ...
- 浅谈Struts2(一)
一.Struts2引言 1.Struts2框架的概念 解决的MVC开发过程中,控制器(Controller)的通用问题. a.什么是MVC开发 MVC开发是一种编程思想,由设计者人为的把一个项目,划分 ...
- Android应用开发实例篇(1)-----简易涂鸦板
链接地址:http://www.cnblogs.com/lknlfy/archive/2012/03/03/2378328.html 一.概述 这次要做一个简单的涂鸦板应用,以前在Qt上实现过,突然想 ...
- BZOJ 1266: [AHOI2006]上学路线route(最短路+最小割)
第一问最短路.第二问,先把最短路的图建出来(边(u,v)满足d[s->u]+d[v->t]+d(u,v)==最短路径长度,就在图中,可以从源点和汇点分别跑一次最短路得到每个点到源点和汇点的 ...