cordova build android get Execution failed for task ':dexArmv7Debug'
本篇文章由:http://xinpure.com/cordova-build-android-get-execution-failed-for-task-dexarmv7debug/
Build 过程及错误原因
Cordova 项目原本是可以正常的 build,在添加了 XGPush 之后就出错了。。。
Input:
cordova build android
Output:
:dexArmv7Debug
UNEXPECTED TOP-LEVEL EXCEPTION:
com.android.dex.DexException: Multiple dex files define Landroid/support/v4/accessibilityservice/AccessibilityServiceInfoCompat$AccessibilityServiceInfoVersionImpl;
at com.android.dx.merge.DexMerger.readSortableTypes(DexMerger.java:579)
at com.android.dx.merge.DexMerger.getSortedTypes(DexMerger.java:535)
at com.android.dx.merge.DexMerger.mergeClassDefs(DexMerger.java:517)
at com.android.dx.merge.DexMerger.mergeDexes(DexMerger.java:164)
at com.android.dx.merge.DexMerger.merge(DexMerger.java:188)
at com.android.dx.command.dexer.Main.mergeLibraryDexBuffers(Main.java:504)
at com.android.dx.command.dexer.Main.runMonoDex(Main.java:334)
at com.android.dx.command.dexer.Main.run(Main.java:277)
at com.android.dx.command.dexer.Main.main(Main.java:245)
at com.android.dx.command.Main.main(Main.java:106)
:dexArmv7Debug FAILED
FAILURE: Build failed with an exception.
* What went wrong:
Execution failed for task ':dexArmv7Debug'.
> com.android.ide.common.internal.LoggedErrorException: Failed to run command:
/Users/xinpure/android-sdk/build-tools/23.0.2/dx --dex --no-optimize --output /Project/gacha-app-hybrid/platforms/android/build/intermediates/dex/armv7/debug --input-list=/Project/gacha-app-hybrid/platforms/android/build/intermediates/tmp/dex/armv7/debug/inputList.txt
Error Code:
2
Output:
UNEXPECTED TOP-LEVEL EXCEPTION:
com.android.dex.DexException: Multiple dex files define Landroid/support/v4/accessibilityservice/AccessibilityServiceInfoCompat$AccessibilityServiceInfoVersionImpl;
at com.android.dx.merge.DexMerger.readSortableTypes(DexMerger.java:579)
at com.android.dx.merge.DexMerger.getSortedTypes(DexMerger.java:535)
at com.android.dx.merge.DexMerger.mergeClassDefs(DexMerger.java:517)
at com.android.dx.merge.DexMerger.mergeDexes(DexMerger.java:164)
at com.android.dx.merge.DexMerger.merge(DexMerger.java:188)
at com.android.dx.command.dexer.Main.mergeLibraryDexBuffers(Main.java:504)
at com.android.dx.command.dexer.Main.runMonoDex(Main.java:334)
at com.android.dx.command.dexer.Main.run(Main.java:277)
at com.android.dx.command.dexer.Main.main(Main.java:245)
at com.android.dx.command.Main.main(Main.java:106)
错误解决方法
添加 XGPush 之后,会在 android/libs 目录下添加一个 android-support-v4.jar, 将此 jar 文件删除即可。
参考链接
https://github.com/phonegap/phonegap-plugin-push/issues/159
cordova build android get Execution failed for task ':dexArmv7Debug'的更多相关文章
- Android Error:Execution failed for task ':app:preDebugAndroidTestBuild'. > Conflict with dependency
错误内容: Error:Execution failed for task ':app:preDebugAndroidTestBuild'.> Conflict with dependency ...
- Android 解决Execution failed for task ':app:clean.'报错
说实话,我还真是没见过比Execution failed for task ':app:clean.'更为恶心,更为不要脸的bug啦,代码没啥问题,一下子行让你爽爽,一下子又不鸟你啦,研究了下,终于找 ...
- Android Error:Execution failed for task ':app:mergeDebugResources'. > Crunching Cruncher bg_btn.9.png
使用Android Studio来进行图片背景设置,编译时发生了一个mergeDebugResources异常. 异常原因 这个异常的意思是对资源合并发生错误,那就是我使用的图片资源有问题,我使用的图 ...
- ionic cordova build android error: commamd failed with exit code eacces
问题: 电脑的gradle版本为Gradle 5.0,然而 因为 添加的android 平台为6.3.0 gradle 是 4.1版本 电脑已存在 gradle的情况下,add platform 成功 ...
- Android Error:Execution failed for task ':app:compileDebugJavaWithJavac' 解决方案
今天使用 Android Studio 构建项目的时候出现了这个错误 compileDebugJavaWithJavac 通过搜索发现造成该问题的原因有很多需要结合具体的项目进行排查 通过 Andro ...
- Android Studio 中 FAILURE: Build failed with an exception. * What went wrong: Execution failed for task ':compileDebugAidl'.的问题解答
Android Studio 中 FAILURE: Build failed with an exception. * What went wrong: Execution failed for ta ...
- Error:Execution failed for task ':app:transformClassesWithDexForDebug'. > com.android.build.api.transform.TransformException: com.android.ide.common.process.ProcessException: java.util.concurrent.Exec
Error:Execution failed for task ':app:transformClassesWithDexForDebug'.> com.android.build.api.tr ...
- ionic 打包 报错Execution failed for task ':processDebugResources'. > com.android.ide.common.process.ProcessException: Failed to execute aapt
在platform --> android目录下找到build.gradle文件,打开并在def promptForReleaseKeyPassword() {...}函数前加入以下内容: 完整 ...
- Android Studio 运行出现 Error:Execution failed for task ':app:transformResourcesWithMergeJavaResForDebug'.
转载请标明出处: http://www.cnblogs.com/why168888/p/5978381.html 本文出自:[Edwin博客园] 我引用compile 'com.squareup.re ...
随机推荐
- jquery 常用获取值得方法汇总
jquery取radio单选按钮的值$("input[name='items']:checked").val();jquery radio取值,checkbox取值,select取 ...
- Centos7 内核从3.10升级到4.12过程
http://blog.csdn.net/youshijifen/article/details/73472434
- 字符集UTFMB4
http://my.oschina.net/leejun2005/blog/232732#OSC_h3_4 http://ju.outofmemory.cn/entry/211473
- 跨域策略文件crossdomain.xml
Web站点通过crossdomain.xml文件(放于站点根目录)配置提供允许的域跨域访问本域内容的权限 以土豆的为例: <cross-domain-policy> <allow-a ...
- oracle维护服务 oracle解决方案 oracle售后服务
为客户提供的oracle 金牌技术服务内容为: 1.电话服务 (7*24) 热线支持电话800-810-0081 每周7天,每天24小时北京技术支持中心每天都有专人值守.以保证及时与客 ...
- Mantis使用说明
Mantis是一个缺陷跟踪系统,以Web操作的形式提供项目管理及缺陷跟踪服务. Mantis可以帮助所有开发人员完成系统需求缺陷的有效管理,对于bug问题的状态变化将通过mail的形式由系统自动通知相 ...
- mac的dns缓存查询和清除
1.清楚dns缓存 dscacheutil -flushcache 2.查询nslookup
- iOS:UI简单的总结
UI简单总结: 一.常用单例: NSBundle *bundel = [NSBundle mainBundle]; //加载资源 NSFileManager *fm = [NSFileManager ...
- 高性能Mysql主从架构的复制原理及配置
1. 复制概述 1.1 mysql支持的复制类型 1.2 复制解决的问题 1.3 复制如何工作 2. 2 复制配置 2.1创建复制帐号 2.2拷贝数据 2.3配置master 2.4配置slave 2 ...
- mac下的一些命令
1.显示隐藏文件 defaults write com.apple.finder AppleShowAllFiles -bool true 2.隐藏隐藏文件 defaults write com.ap ...