1 [INFO] Assembling webapp [crm9] in [/home/wukongcrm/72crm-java/target/ROOT]
2 [INFO] Processing war project
3 [INFO] Copying webapp resources [/home/wukongcrm/72crm-java/src/main/webapp]
4 [INFO] Webapp assembled in [803 msecs]
5 [INFO] Building war: /home/wukongcrm/72crm-java/target/ROOT.war
6 [INFO] WEB-INF/web.xml already added, skipping
7 [INFO]
8 [INFO] --- maven-assembly-plugin:3.1.0:single (make-assembly) @ crm9 ---
9 [INFO] Reading assembly descriptor: package.xml
10 [WARNING] The assembly descriptor contains a filesystem-root relative reference, which is not cross platform compatible /
11 [INFO] Copying files to /crm9-release
12 [WARNING] Assembly file: /crm9-release is not a regular file (it may be a directory). It cannot be attached to the project build for installation or deployment.
13 [WARNING] The assembly descriptor contains a filesystem-root relative reference, which is not cross platform compatible /
14 [INFO] Building zip: /crm9-release.zip
15 [INFO] ------------------------------------------------------------------------
16 [INFO] BUILD FAILURE
17 [INFO] ------------------------------------------------------------------------
18 [INFO] Total time: 36.457 s
19 [INFO] Finished at: 2021-03-09T00:16:40+08:00
20 [INFO] ------------------------------------------------------------------------
21 [ERROR] Failed to execute goal org.apache.maven.plugins:maven-assembly-plugin:3.1.0:single (make-assembly) on project crm9: Failed to create assembly: Error creating assembly archive release: Problem creating zip: Execution exception: Java heap space -> [Help 1]
22 [ERROR]
23 [ERROR] To see the full stack trace of the errors, re-run Maven with the -e switch.
24 [ERROR] Re-run Maven using the -X switch to enable full debug logging.
25 [ERROR]
26 [ERROR] For more information about the errors and possible solutions, please read the following articles:
27 [ERROR] [Help 1] http://cwiki.apache.org/confluence/display/MAVEN/MojoExecutionException
28 [root@iZuf61a0txqwssk09l6exrZ 72crm-java]#

[checking com.kakarote.crm9.common.config.CrmDirective]
[wrote RegularFileObject[/home/wukongcrm/72crm-java/target/classes/com/kakarote/crm9/common/config/CrmDirective.class]]
[checking com.kakarote.crm9.erp.bi.service.BiService]
[wrote RegularFileObject[/home/wukongcrm/72crm-java/target/classes/com/kakarote/crm9/erp/bi/service/BiService.class]]
[checking com.kakarote.crm9.erp.admin.service.AdminExamineService]
[wrote RegularFileObject[/home/wukongcrm/72crm-java/target/classes/com/kakarote/crm9/erp/admin/service/AdminExamineService.class]]
[checking com.kakarote.crm9.erp.admin.entity.AdminExamine]
[wrote RegularFileObject[/home/wukongcrm/72crm-java/target/classes/com/kakarote/crm9/erp/admin/entity/AdminExamine.class]]
[checking com.kakarote.crm9.erp.admin.controller.AdminSceneController]
[wrote RegularFileObject[/home/wukongcrm/72crm-java/target/classes/com/kakarote/crm9/erp/admin/controller/AdminSceneController.class]]
[checking com.kakarote.crm9.erp.work.common.WorkRouter]
[wrote RegularFileObject[/home/wukongcrm/72crm-java/target/classes/com/kakarote/crm9/erp/work/common/WorkRouter.class]]
[checking com.kakarote.crm9.common.config.druid.DruidConfig]
[wrote RegularFileObject[/home/wukongcrm/72crm-java/target/classes/com/kakarote/crm9/common/config/druid/DruidConfig.class]]
[checking com.kakarote.crm9.erp.admin.controller.AdminExamineRecordController]
[wrote RegularFileObject[/home/wukongcrm/72crm-java/target/classes/com/kakarote/crm9/erp/admin/controller/AdminExamineRecordController.class]]
[checking com.kakarote.crm9.erp.crm.controller.CrmBackLogController]
[wrote RegularFileObject[/home/wukongcrm/72crm-java/target/classes/com/kakarote/crm9/erp/crm/controller/CrmBackLogController.class]]
[checking com.kakarote.crm9.erp.crm.service.CrmBackLogService]
[wrote RegularFileObject[/home/wukongcrm/72crm-java/target/classes/com/kakarote/crm9/erp/crm/service/CrmBackLogService.class]]
[checking com.kakarote.crm9.erp.oa.controller.OaExamineController]
[wrote RegularFileObject[/home/wukongcrm/72crm-java/target/classes/com/kakarote/crm9/erp/oa/controller/OaExamineController.class]]
[checking com.kakarote.crm9.erp.oa.service.OaExamineService]
[wrote RegularFileObject[/home/wukongcrm/72crm-java/target/classes/com/kakarote/crm9/erp/oa/service/OaExamineService.class]]
[checking com.kakarote.crm9.erp.oa.entity.OaExamine]
[wrote RegularFileObject[/home/wukongcrm/72crm-java/target/classes/com/kakarote/crm9/erp/oa/entity/OaExamine.class]]
[checking com.kakarote.crm9.erp.oa.common.OaRouter]
[wrote RegularFileObject[/home/wukongcrm/72crm-java/target/classes/com/kakarote/crm9/erp/oa/common/OaRouter.class]]
[checking com.kakarote.crm9.utils.TagUtil]
[wrote RegularFileObject[/home/wukongcrm/72crm-java/target/classes/com/kakarote/crm9/utils/TagUtil.class]]
[checking com.kakarote.crm9.common.config.redis.RedisManager]
[loading ZipFileIndexFileObject[/root/.m2/repository/redis/clients/jedis/2.9.0/jedis-2.9.0.jar(redis/clients/jedis/JedisPoolConfig.class)]]
[loading ZipFileIndexFileObject[/root/.m2/repository/org/apache/commons/commons-pool2/2.4.2/commons-pool2-2.4.2.jar(org/apache/commons/pool2/impl/GenericObjectPoolConfig.class)]]
[loading ZipFileIndexFileObject[/root/.m2/repository/org/apache/commons/commons-pool2/2.4.2/commons-pool2-2.4.2.jar(org/apache/commons/pool2/impl/BaseObjectPoolConfig.class)]]
[loading ZipFileIndexFileObject[/root/.m2/repository/redis/clients/jedis/2.9.0/jedis-2.9.0.jar(redis/clients/jedis/HostAndPort.class)]]
[wrote RegularFileObject[/home/wukongcrm/72crm-java/target/classes/com/kakarote/crm9/common/config/redis/RedisManager.class]]
[checking com.kakarote.crm9.common.config.druid.DruidFilter]
[loading ZipFileIndexFileObject[/usr/java/jdk1.8.0_221-amd64/lib/ct.sym(META-INF/sym/rt.jar/java/sql/SQLClientInfoException.class)]]
[loading ZipFileIndexFileObject[/usr/java/jdk1.8.0_221-amd64/lib/ct.sym(META-INF/sym/rt.jar/javax/management/ListenerNotFoundException.class)]]
[loading ZipFileIndexFileObject[/usr/java/jdk1.8.0_221-amd64/lib/ct.sym(META-INF/sym/rt.jar/javax/management/OperationsException.class)]]
[loading ZipFileIndexFileObject[/usr/java/jdk1.8.0_221-amd64/lib/ct.sym(META-INF/sym/rt.jar/javax/management/JMException.class)]]
[wrote RegularFileObject[/home/wukongcrm/72crm-java/target/classes/com/kakarote/crm9/common/config/druid/DruidFilter.class]]
[checking com.kakarote.crm9.erp.work.controller.TrashController]
[wrote RegularFileObject[/home/wukongcrm/72crm-java/target/classes/com/kakarote/crm9/erp/work/controller/TrashController.class]]
[checking com.kakarote.crm9.erp.crm.controller.CrmBusinessController]
[wrote RegularFileObject[/home/wukongcrm/72crm-java/target/classes/com/kakarote/crm9/erp/crm/controller/CrmBusinessController.class]]
[checking com.kakarote.crm9.erp.oa.controller.OaLogController]
[wrote RegularFileObject[/home/wukongcrm/72crm-java/target/classes/com/kakarote/crm9/erp/oa/controller/OaLogController.class]]
[checking com.kakarote.crm9.common.config.render.ErpRenderFactory]
[wrote RegularFileObject[/home/wukongcrm/72crm-java/target/classes/com/kakarote/crm9/common/config/render/ErpRenderFactory.class]]
[checking com.kakarote.crm9.erp.work.controller.WorkController]
[wrote RegularFileObject[/home/wukongcrm/72crm-java/target/classes/com/kakarote/crm9/erp/work/controller/WorkController.class]]
[checking com.kakarote.crm9.erp.bi.controller.BiCustomerController]
[wrote RegularFileObject[/home/wukongcrm/72crm-java/target/classes/com/kakarote/crm9/erp/bi/controller/BiCustomerController.class]]
[checking com.kakarote.crm9.erp.admin.entity.CrmBusinessStatus]
[wrote RegularFileObject[/home/wukongcrm/72crm-java/target/classes/com/kakarote/crm9/erp/admin/entity/CrmBusinessStatus.class]]
[checking com.kakarote.crm9.erp.bi.controller.BiController]
[wrote RegularFileObject[/home/wukongcrm/72crm-java/target/classes/com/kakarote/crm9/erp/bi/controller/BiController.class]]
[checking com.kakarote.crm9.common.config.paragetter.PageParaGetter]
[wrote RegularFileObject[/home/wukongcrm/72crm-java/target/classes/com/kakarote/crm9/common/config/paragetter/PageParaGetter.class]]
[checking com.kakarote.crm9.common.constant.BaseConstant]
[wrote RegularFileObject[/home/wukongcrm/72crm-java/target/classes/com/kakarote/crm9/common/constant/BaseConstant.class]]
[checking com.kakarote.crm9.erp.admin.entity.AdminExamineStep]
[wrote RegularFileObject[/home/wukongcrm/72crm-java/target/classes/com/kakarote/crm9/erp/admin/entity/AdminExamineStep.class]]
[checking com.kakarote.crm9.erp.crm.controller.InstrumentController]
[wrote RegularFileObject[/home/wukongcrm/72crm-java/target/classes/com/kakarote/crm9/erp/crm/controller/InstrumentController.class]]
[checking com.kakarote.crm9.utils.Sort]
[wrote RegularFileObject[/home/wukongcrm/72crm-java/target/classes/com/kakarote/crm9/utils/Sort.class]]
[checking com.kakarote.crm9.erp.crm.common.FormTypeEnum]
[wrote RegularFileObject[/home/wukongcrm/72crm-java/target/classes/com/kakarote/crm9/erp/crm/common/FormTypeEnum.class]]
[checking com.kakarote.crm9.erp.crm.cron.CrmCustomerCron]
[wrote RegularFileObject[/home/wukongcrm/72crm-java/target/classes/com/kakarote/crm9/erp/crm/cron/CrmCustomerCron.class]]
[checking com.kakarote.crm9.erp.admin.controller.AdminExamineController]
[wrote RegularFileObject[/home/wukongcrm/72crm-java/target/classes/com/kakarote/crm9/erp/admin/controller/AdminExamineController.class]]
[checking com.kakarote.crm9.erp.bi.controller.BiWorkController]
[wrote RegularFileObject[/home/wukongcrm/72crm-java/target/classes/com/kakarote/crm9/erp/bi/controller/BiWorkController.class]]
[checking com.kakarote.crm9.erp._MappingKit]
[wrote RegularFileObject[/home/wukongcrm/72crm-java/target/classes/com/kakarote/crm9/erp/_MappingKit.class]]
[checking com.kakarote.crm9.common.config.redis.RedisPlugin]
[wrote RegularFileObject[/home/wukongcrm/72crm-java/target/classes/com/kakarote/crm9/common/config/redis/RedisPlugin.class]]
[checking com.kakarote.crm9.utils._JFinalGenerator]
[wrote RegularFileObject[/home/wukongcrm/72crm-java/target/classes/com/kakarote/crm9/utils/_JFinalGenerator.class]]
[checking com.kakarote.crm9.erp.oa.controller.OaActionRecordController]
[wrote RegularFileObject[/home/wukongcrm/72crm-java/target/classes/com/kakarote/crm9/erp/oa/controller/OaActionRecordController.class]]
[total 9882ms]
[INFO] /home/wukongcrm/72crm-java/src/main/java/com/kakarote/crm9/erp/crm/entity/base/BaseCrmLeads.java: Some input files use unchecked or unsafe operations.
[INFO] /home/wukongcrm/72crm-java/src/main/java/com/kakarote/crm9/erp/crm/entity/base/BaseCrmLeads.java: Recompile with -Xlint:unchecked for details.
[INFO]
[INFO] --- maven-resources-plugin:2.6:testResources (default-testResources) @ crm9 ---
[INFO] Using 'UTF-8' encoding to copy filtered resources.
[INFO] skip non existing resourceDirectory /home/wukongcrm/72crm-java/src/test/resources
[INFO]
[INFO] --- maven-compiler-plugin:3.6.1:testCompile (default-testCompile) @ crm9 ---
[INFO] No sources to compile
[INFO]
[INFO] --- maven-surefire-plugin:2.12.4:test (default-test) @ crm9 ---
[INFO] No tests to run.
[INFO]
[INFO] --- maven-war-plugin:2.2:war (default-war) @ crm9 ---
[INFO] Packaging webapp
[INFO] Assembling webapp [crm9] in [/home/wukongcrm/72crm-java/target/ROOT]
[INFO] Processing war project
[INFO] Copying webapp resources [/home/wukongcrm/72crm-java/src/main/webapp]
[INFO] Webapp assembled in [803 msecs]
[INFO] Building war: /home/wukongcrm/72crm-java/target/ROOT.war
[INFO] WEB-INF/web.xml already added, skipping
[INFO]
[INFO] --- maven-assembly-plugin:3.1.0:single (make-assembly) @ crm9 ---
[INFO] Reading assembly descriptor: package.xml
[WARNING] The assembly descriptor contains a filesystem-root relative reference, which is not cross platform compatible /
[INFO] Copying files to /crm9-release
[WARNING] Assembly file: /crm9-release is not a regular file (it may be a directory). It cannot be attached to the project build for installation or deployment.
[WARNING] The assembly descriptor contains a filesystem-root relative reference, which is not cross platform compatible /
[INFO] Building zip: /crm9-release.zip
[INFO] ------------------------------------------------------------------------
[INFO] BUILD FAILURE
[INFO] ------------------------------------------------------------------------
[INFO] Total time: 36.457 s
[INFO] Finished at: 2021-03-09T00:16:40+08:00
[INFO] ------------------------------------------------------------------------
[ERROR] Failed to execute goal org.apache.maven.plugins:maven-assembly-plugin:3.1.0:single (make-assembly) on project crm9: Failed to create assembly: Error creating assembly archive release: Problem creating zip: Execution exception: Java heap space -> [Help 1]
[ERROR]
[ERROR] To see the full stack trace of the errors, re-run Maven with the -e switch.
[ERROR] Re-run Maven using the -X switch to enable full debug logging.
[ERROR]
[ERROR] For more information about the errors and possible solutions, please read the following articles:
[ERROR] [Help 1] http://cwiki.apache.org/confluence/display/MAVEN/MojoExecutionException

  

maven error的更多相关文章

  1. 解决:[ERROR] Error executing Maven. [ERROR] 1 problem was encountered while building the effective set

    1. 报错如下: [ERROR] Error executing Maven. [ERROR] 1 problem was encountered while building the effecti ...

  2. maven Error resolving version for plugin 'org.apache.maven.plugins:maven-eclipse-plugin' from the repositories 解决

    报错:Error resolving version for plugin 'org.apache.maven.plugins:maven-eclipse-plugin' from the repos ...

  3. Maven - error in opening zip file

    在一个maven工程中,有时执行mvn打包,部署,编译等命令,例如mvn clean install -DskipTests -U等命令时,会报类似(error in opening zip file ...

  4. Maven error in eclipse (pom.xml) : Failure to transfer org.apache.maven.plugins:maven-surefire-plugin:pom:2.12.4

    i wanna make web project using the Maven to import automatically all libraries that i need, so i cho ...

  5. Maven [ERROR] 不再支持源选项 5,请使用 7 或更高版本的解决办法

    刚刚学Maven,当我点击test时 就出现了这两个错误: [ERROR] 不再支持源选项 5.请使用 7 或更高版本.[ERROR] 不再支持目标选项 5.请使用 7 或更高版本. 后来在看到这篇文 ...

  6. MAVEN ERROR : Dynamic Web Module 3.0 requires Java 1.6 or newer

    问题: 在eclipse中,通过Maven->Update Project更新项目后,出现Dynamic Web Module 3.0 requires Java 1.6 or newer错误提 ...

  7. MAVEN ERROR: unable to find valid certification path to requested target 解决办法

    第一次使用MAVEN编译项目,出现如下错误 解决办法:Maven的setting.xml中添加如下代码 <mirrors> <mirror> <id>Central ...

  8. Maven [ERROR] 不再支持源选项 5。请使用 6 或更高版本

    报错信息如下 解决办法一 在settings.xml文件中指定jdk版本 既可以修改全局的settings.xml文件(C:\Program Files\apache-maven-3.6.0\conf ...

  9. MAVEN ERROR maven-resources-plugin

    maven新建项目时报错 Could not calculate build plan: Plugin org.apache.maven.plugins:maven-resources-plugin: ...

  10. MAVEN Error: Using platform encoding (GBK actually) to copy filtered resources.....

    环境:Maven3.2.5+MyEclipse 2015CI 现象:在Maven编译过程中出现错误信息:Using platform encoding (GBK actually) to copy f ...

随机推荐

  1. 03-面试必会-Mysql篇

    1. Mysql 查询语句的书写顺序 Select [distinct ] <字段名称> from 表 1 [ <join 类型> join 表 2 on <join 条 ...

  2. 效率回归,工具库之美「GitHub 热点速览」

    刚开源就变成新星的 igl,不仅获得了 2k+ star,也能提高你开发游戏的效率,摆平一切和图形有关的问题.如果这个没有那么惊艳的话,还有 The-Art-of-Linear-Algebra,重燃了 ...

  3. Stable Diffusion修复老照片-图生图

    修复老照片的意义就不多说了,相信大家都明白,这里直接开讲方法. 1.原理 这个方法需要一个真实模型,以便让修复的照片看起来比较真实,我这里选择:realisticVisionV20,大家有更好的给我推 ...

  4. 【Azure API Management】实现在API Management服务中使用MI(管理标识 Managed Identity)访问启用防火墙的Storage Account

    问题描述 在Azure的同一数据中心,API Management访问启用了防火墙的Storage Account,并且把APIM的公网IP地址设置在白名单.但访问依旧是403 原因是: 存储帐户部署 ...

  5. 河南省第十四届icpc大学生程序设计竞赛-clk

    这次比赛赛程比较长,520出发,521,回学校,出发的那一天有点热,感觉不是很好,而且那一天感觉有点生病,应该只是普通感冒,热身赛的时候被oier吊打,省实验真厉害,晚上回酒店后,我喊队友,补了前年的 ...

  6. ListView选中获取数据并弹出菜单项

    前言 作为一名Android小白,我在编写过程中,使用ListView列表,想要使用他来完成长按弹出菜单选项,并且还要进行事件操作,经过百度编程的经历后,终于成功完成.在此附上这块比较完整的代码,理论 ...

  7. 图技术在 LLM 下的应用:知识图谱驱动的大语言模型 Llama Index

    LLM 如火如荼地发展了大半年,各类大模型和相关框架也逐步成型,可被大家应用到业务实际中.在这个过程中,我们可能会遇到一类问题是:现有的哪些数据,如何更好地与 LLM 对接上.像是大家都在用的知识图谱 ...

  8. Robot Framework 自动化测试部署常见问题及处理方法(一)

    1.在Python>>Scripts中运行python ride.py时报错 现象: 1 Traceback (most recent call last): 2 File "E ...

  9. Pandas:删除最后一行

    解决方案 代码 效果展示 完整代码 import pandas as pd import numpy as np df = pd.DataFrame(np.arange(12).reshape(3,4 ...

  10. Cilium系列-9-主机路由切换为基于 BPF 的模式

    系列文章 Cilium 系列文章 前言 将 Kubernetes 的 CNI 从其他组件切换为 Cilium, 已经可以有效地提升网络的性能. 但是通过对 Cilium 不同模式的切换/功能的启用, ...