若 docker build 时遇到了错误 "ERROR: No build stage in current context",则有可能是没有将 FROM 命令语句放置在第一行。

问题

例如,Dockerfile 文件如下:

MAINTAINER FengYin Xu
# builder stage
FROM node:16-alpine as builder
ARG APP_HOME=/home/web/app
# Create app directory
WORKDIR ${APP_HOME}
# Install app dependencies
# A wildcard is used to ensure both package.json AND package-lock.json are copied
# where available (npm@5+)
COPY package*.json ${APP_HOME}/
RUN npm install
# build production package
COPY . ${APP_HOME}/
RUN npm run build

以上 Dockerfile 在 docker build . 时会遇到错误:

解决方案

解决方案很简单,将 FROM 命令语句移动到最前面,作为第一行即可。

# builder stage
FROM node:16-alpine as builder
MAINTAINER FengYin Xu
ARG APP_HOME=/home/web/app
# Create app directory
WORKDIR ${APP_HOME}
# Install app dependencies
# A wildcard is used to ensure both package.json AND package-lock.json are copied
# where available (npm@5+)
COPY package*.json ${APP_HOME}/
RUN npm install
# build production package
COPY . ${APP_HOME}/
RUN npm run build

修复 docker build 错误 "ERROR: No build stage in current context"的更多相关文章

  1. InstallShield Build错误:Internal build error 6041

    点击左侧菜单: Media-Release-选择release版本(例如Release1)-Build标签-   keey unused directories 改为no(默认为yes)

  2. wepy build 错误 [Error] 未发现相关 less 编译器配置,请检查wepy.config.js文件。

    [Error] 未发现相关 less 编译器配置,请检查wepy.config.js文件. 缺少less包,npm install less -d

  3. 解决docker启动错误 error creating overlay mount to /var/lib/docker/overlay2

    原文 最近在centos7.1使用docker运行redis镜像,出现下面的错误: /usr/bin/docker-current: Error response from daemon: error ...

  4. 安装包安装服务,点修复出现的错误”Error 1001:指定的服务已存在“ 解决办法

    安装项目下,右键视图->自定义操作,出现安装.提交.回滚.卸载四个文件夹,右键安装,添加自定义操作,选择安装的服务为输出文件 右键安装输出文件->在condition->Not (I ...

  5. VS2013下开发VC++程序,编译时提示错误error MSB8020: The build tools for v140 (Platform Toolset = 'v140') 的解决方案

    1. 问题描述: 提示如下错误:error MSB8020: The builds tools for v140 (Platform Toolset = 'v140') cannot be found ...

  6. 【Problem】前端项目运行:Module build failed:Error Node Sass does not yet support my current environmen

    我在运行renren-fast-vue前端项目时,安装完依赖cnpm install 启动服务npm run dev 出现问题. Module build failed: Error: Node Sa ...

  7. NDK配置debug环境时:Error:FAILURE: Build failed with an exception

    Error:FAILURE: Build failed with an exception. * What went wrong: Execution failed for task ':app:ex ...

  8. vue build错误异常的解决方法

    在生成vue项目的时候,出现如下错误 ERROR in static/js/index.d66d806fcdd72b36147b.js from UglifyJs Unexpected token: ...

  9. Module build failed: Error: Cannot find module 'url-loader' 的坑

    本文地址:http://www.cnblogs.com/jying/p/8280956.html 开发环境:react.webpack.es5 引用图片报错:Module build failed: ...

  10. Vue, element-ui Module build failed: Error: No PostCSS Config found

    使用vue框架写pc页面时,我们经常会用到element-ui这个框架. 当我们吧把需要的东西都装在好运行项目的时候,有时会出现这样的错误, Module build failed: Error: N ...

随机推荐

  1. KingbaseES XA 分布式事务

    在分布式系统中,各个节点(或者事务参与方)之间在物理上相互独立,各节点之间无法确切地知道其它节点中的事务执行情况,所以多节点之间很难保证ACID,尤其是原子性.如果是单节点的事务,由于存在事务机制,可 ...

  2. Linux 压缩、解压缩命令

    Linux 压缩.解压缩命令 tar 语法命令 tar [options-] [files] options: 选择 描述 -A 追加tar文件至归档 -c 创建一个新文档 -d 找出归档和文件系统的 ...

  3. [Python]-opencv-python模块(cv2)-图片读取和格式转换

    python常常用opencv模块来处理图像. import cv2 as cv 读取图片:imread() 默认按照彩色三通道读取: img = cv2.imread(path) 读取灰度图: im ...

  4. setw()

    setw() 头文件是 #include<iomanip> setw(2)是下一个数据输出宽度为2,超过2则以实际输出为准,不足2补空格.仅对下一个数据的输出有效,即只有一次效果.(set ...

  5. 搭建Elasitc stack集群需要注意的日志问题

    文章转载自:https://blog.csdn.net/u013613428/article/details/84943577 {{uploading-image-736853.png(uploadi ...

  6. OpenglEs之三角形绘制

    在前面我们已经在NDK层搭建好了EGL环境,也介绍了一些着色器相关的理论知识,那么这次我们就使用已经搭配的EGL绘制一个三角形吧. 在Opengl ES的世界中,无论多复杂的形状都是由点.线或三角形组 ...

  7. 字符串反码A

    while True: try: string=input() if string!="!": res="" for i in string: if i.isu ...

  8. PAT (Basic Level) Practice 1030 完美数列 分数 25

    给定一个正整数数列,和正整数 p,设这个数列中的最大值是 M,最小值是 m,如果 M≤mp,则称这个数列是完美数列. 现在给定参数 p 和一些正整数,请你从中选择尽可能多的数构成一个完美数列. 输入格 ...

  9. springboot自动配置原理以及手动实现配置类

    springboot自动配置原理以及手动实现配置类 1.原理 spring有一个思想是"约定大于配置". 配置类自动配置可以帮助开发人员更加专注于业务逻辑开发,springboot ...

  10. P3919 【模板】可持久化线段树 1(可持久化数组)

    还是用主席树来做(因为提到不同的版本),这时候的主席树不是以权值为下标的,就是普通的线段树,维护范围1~n,i存的是a[ ]中的数. 1 #include <bits/stdc++.h> ...