问题描述

在electron-vue执行npm run build时报错,错误如下:

⨯ cannot execute cause=fork/exec C:\Users\801\AppData\Local\electron-builder\Cache\winCodeSign\winCodeSign-2.5.0\rcedit-ia32.exe: Access is denied.
command='C:\Users\801\AppData\Local\electron-builder\Cache\winCodeSign\winCodeSign-2.5.0\rcedit-ia32.exe' 'C:\temp\wechat\build\win-ia32-unpacked\wechat.exe' --set-version-string FileDescription wechat --set-version-string ProductName wechat --set-version-string LegalCopyright 'Copyright © 2019 wechat' --set-file-version 0.0.1 --set-product-version 0.0.1.0 --set-version-string InternalName wechat --set-version-string OriginalFilename ''
workingDir=
npm ERR! code ELIFECYCLE
npm ERR! errno 1
npm ERR! wechat@0.0.1 build: `node .electron-vue/build.js && electron-builder`
npm ERR! Exit status 1
npm ERR!
npm ERR! Failed at the wechat@0.0.1 build script.
npm ERR! This is probably not a problem with npm. There is likely additional logging output above.

npm ERR! A complete log of this run can be found in:
npm ERR! C:\Users\801\AppData\Roaming\npm-cache\_logs\2019-10-21T10_06_37_071Z-debug.log

解决方式

发现电脑右下角有一个提示,那个提示现在也没法重现了,大概意思就是这个执行程序被我设置阻止运行了,点击打开,把他移除被阻止运行即可。

electron-vue在npm run build时报错 ⨯ cannot execute cause=fork/exec C:\Users\801\AppData\Local\electron-builder\Cache\winCodeSign\winCodeSign-2.5.0\rcedit-ia32.exe: Access is denied.的更多相关文章

  1. npm run build 时报错operation not permitted

    1.项目使用vue框架,在npm run build 打包时报错: 访问对应的目录,发现无法打开,原来是文件被其他应用程序占用了,仔细看了一下,xftp文件传输的软件打开着,把它关闭以后,重新运行np ...

  2. 运行项目npm run dev时报错: ~Error: Cannot find module 'webpack-cli/bin/config-yargs', 原因是

    webpack@3.X运行项目npm run dev时报错: ~Error: Cannot find module 'webpack-cli/bin/config-yargs' 我的原因是:  web ...

  3. 使用vue框架运行npm run dev 时报错解决

    使用使用vue框架运行npm run dev 时报错 如下: 原因: localhost:8080 有可能其他软件占用了,导致其他问题的出现 我们可以动态修改地址 解决: 进入项目文件的config文 ...

  4. vue中执行npm run build报错解决方法?

    遇到了执行npm run build 后报错: [build:js ] Module not found: Error: Can't resolve 'scss-loader' in 'D:\work ...

  5. Laravel5.5执行 npm run dev时报错,提示cross-env找不到(not found)的解决办法

    Laravel 5.4 Mix & Laravel5.5执行 npm run dev时报错,提示cross-env找不到(not found)的解决办法   首先进入package.json文 ...

  6. vue使用npm run build命令打包

    vue使用npm run build命令打包项目   当我们使用vue-cli脚手架完成一个项目的时候,下一步肯定会想要怎么把这个项目放到互联网上或者本地直接打开呢,我们在本地调试的时候只要命令行执行 ...

  7. vue-electron 使用sqlite3数据库,执行npm run build 报错 .NET Framework 2.0 SDK,Microsoft Visual Studio 2005[C:\temp\wechat\node_modules\sqlite3\build\binding.sln]

    问题描述 vue-electron 使用sqlite3数据库,执行npm run build 报错如下: .NET Framework 2.0 SDK,Microsoft Visual Studio ...

  8. vue项目npm run dev 报错error in ./src/main.js Module build failed: Error: Cannot find module 'babel-plugin-syntax-jsx'

    问题: vue 项目npm run dev运行时报错,如下图:  原因: 缺少相应的组件 解决办法: 安装相应组件: npm install babel-plugin-syntax-jsx --sav ...

  9. vue项目npm run dev 报错error in ./src/main.js Module build failed: ReferenceError: Unknown plugin "transform-vue-jsx" specified in......

    问题: vue项目npm run dev运行时报错,如下图:  原因: 缺少组件 解决办法: 安装相应的组件:  npm install babel-plugin-transform-vue-jsx ...

随机推荐

  1. Android跨进程通信AIDL服务

    服务(Service)是android系统中非常重要的组件.Service可以脱离应用程序运行.也就是说,应用程序只起到一个启动Service的作用.一但Service被启动,就算应用程序关闭,Ser ...

  2. Android中代码优化

    两个基本准则: 1.不要做冗余的工作 2.尽量避免次数过多的内存分配操作 Handler和内部类的正确使用 正确使用Context 正确使用Java四种引用方式:软引用,弱引用,虚引用,强引用 避免创 ...

  3. maven项目无法导入Oracle的jdbc连接jar包【我】

    导入一个maven项目,启动一直报错 找不到Oracle的jdbc连接驱动Class, 用Eclipse导入 ojdbc14.jar 连接包,各种方法都无效,无法引入到部署后的lib目录中,可以直接放 ...

  4. unix进程通信方式总结(中)(转)

    在上一篇博客http://blog.csdn.net/caoyan_12727/article/details/52049417已经总结了<<uinx环境高级编程>>进程通信前 ...

  5. MySQLdb User's Guide

    MySQLdb MySQLdb-1.2.2 API documentation http://mysql-python.sourceforge.net/MySQLdb-1.2.2/ MySQLdb U ...

  6. centos6 安装docker

    docker 安装要求内核大于3.10 , 而centos6 机器上内核一般是2.6 , 除了升级内核外, 还可以安装低版本的docker , 本文介绍docker 1.7的安装. 机器 环境 [ro ...

  7. Kafka相关概念及核心配置说明

    1. Kafka简介 Kafka是最初由Linkedin公司开发,是一个分布式.支持分区的(partition).多副本的(replica),基于zookeeper协调的分布式消息系统,它的最大的特性 ...

  8. UIView和UIWindow的使用

    1.创建窗口: func application(application: UIApplication, didFinishLaunchingWithOptions launchOptions: [N ...

  9. ProbCog[github]使用心得

    1. After installing ProbCog,you can run blnquery and mlnquery. If the terminal warns that 'command n ...

  10. python-Web-django-图表统计

    下载highchart插件包,放在static下 <script src="/static/highcharts/highcharts.js"></script& ...