GUI:microwindows-0.89pre8+nona-X

you are successful compiling, run nano-X,below is information:

~/microwindows-.89pre8/src/bin$ ./nano-X

Cannot bind to named socket

resolve:

One thing that will cause this error error is the inability to create (or delete) the named socket "/tmp/.nano-X". You may have problems with this if one user creates the socket and then nano-X subsequently crashes if you try to run nano-X from another userid you will get this error.

Delete the named socket "/tmp/.nano-X" if it exists, otherwise verify that the userid that is attempting to run nano-X has write permissions to the /tmp directory.

~/microwindows-0.89pre8/src/bin$ ./nano-X error:Cannot bind to named socket的更多相关文章

  1. (python走过的坑)OpenCV中错误opencv-3.3.1\modules\highgui\src\window.cpp:339: error: (-215) size.width>0 && size.height>0 in function cv::imshow

    第一次在python中使用OpenCV(cv2),运行时报错opencv-3.3.1\modules\highgui\src\window.cpp:339: error: (-215) size.wi ...

  2. 编译gcc报错make[3]: Leaving directory `/usr/local/src/gcc-7.4.0/build/gcc' make[2]: *** [all-stage1-gcc] Error 2 处理

    因业务需要安装7.4高版本gcc时报错: configure: error: in `/usr/local/src/gcc-7.4.0/build/gcc': configure: error: C+ ...

  3. vue报错之Duplicate keys detected: '0'. This may cause an update error.

    昨天运行vue项目的时候,出现了[Vue warn]: Duplicate keys detected: '0'. This may cause an update error(错误,检测到重复的ke ...

  4. [Vue warn]: Duplicate keys detected: '0'. This may cause an update error.

    1.[Vue warn]: Duplicate keys detected: '0'. This may cause an update error. 第一眼看到这个错误一脸懵逼,项目使用很久了,代码 ...

  5. Duplicate keys detected: '0'. This may cause an update error.

    在运行vue项目的时候报了:[Vue warn]: Duplicate keys detected: ‘0’. This may cause an update error(错误,检测到重复的key值 ...

  6. opencv —— src.at<Vec3b>(i, j)[0]、src.at<uchar>(i, j)、src.ptr<uchar>(i) 访问图像的单个像素

    动态地址访问像素:src.at<Vec3b>(i, j)[0].src.at<uchar>(i, j)  int b = src.at<Vec3b>(i, j)[0 ...

  7. D:\Software\Keil5\ARM\PACK\Keil\STM32F1xx_DFP\2.1.0\Device\Include\stm32f10x.h(483): error: #5: cannot open source input file "core_cm3.h": No such file or directory

    1. 错误提示信息: D:\Software\Keil5\ARM\PACK\Keil\STM32F1xx_DFP\2.1.0\Device\Include\stm32f10x.h(483): erro ...

  8. Nginx在make时报错[objs/Makefile:469: objs/src/core/ngx_murmurhash.o] Error

    Nginx在make时报错[objs/Makefile:469: objs/src/core/ngx_murmurhash.o] Error   在安装目录下执行 vim obj/Markfile 把 ...

  9. ERROR: transport error 202: bind failed: Address already in use

    早上上班,同事反应服务上不去,后台看了一下,发现tomcat挂掉了,重新启动tomcat时报错. ERROR: transport error 202: bind failed: Address al ...

随机推荐

  1. mybatis动态SQL的<set>条件

    写代码,作笔记是个好习惯: <update id="update" parameterType="FaultMainten"> update FAU ...

  2. Lucene学习总结之七:Lucene搜索过程解析

    一.Lucene搜索过程总论 搜索的过程总的来说就是将词典及倒排表信息从索引中读出来,根据用户输入的查询语句合并倒排表,得到结果文档集并对文档进行打分的过程. 其可用如下图示: 总共包括以下几个过程: ...

  3. knockout.js简单实用教程1

    第一次接触knockout是在一年多之前吧.当时是接手了一个别人的项目,在项目中有用到knockout来进行数据的绑定.也就开始学习起来knockout.在之后的项目中也多次用到了这个.在第一次开始学 ...

  4. python模范发送邮件的时候,才smtp.connect的时候总是抛出错误

    python发送邮件的时候,总是出现:[Errno 10060] 错误码 根据debug得到在connect的时候出错. 认真检查了下host,没有错呀~应该就是服务器的host. 查看了下网上的一些 ...

  5. LeetCode_Jump Game

    Given an array of non-negative integers, you are initially positioned at the first index of the arra ...

  6. 2015第10周四-CSS小结

    这两天做前台页面发现个人在CSS前端方法很多基础知识都忘了,晚上又搜索学习了下,把相关内容摘录总结. CSS 规则由两个主要的部分构成:选择器,以及一条或多条声明. selector {declara ...

  7. cf479A Expression

    A. Expression time limit per test 1 second memory limit per test 256 megabytes input standard input ...

  8. 【DP问题集】动态规划试题

    1.背包问题 给定n种物品和一背包.物品i的重量是wi,其价值为pi,背包的容量为C.问应如何选择装入背包的物品,使得装入背包中物品的总价值最大? 分析: ①每个物品只有两种选择,要么就是塞到包里面, ...

  9. tc令牌桶限速心得

    一.实验拓扑与实验现象 实验拓扑如图所示,在①号机上发送数据,③号机上接受数据,同时在④号机的eth1与eth2网口限制速率为115200kbps,命令如下 tc qdisc add dev eth1 ...

  10. hdu 4751 Divide Groups(dfs染色 或 2-sat)

    Problem Description   This year is the 60th anniversary of NJUST, and to make the celebration more c ...