Failed to execute goal org.apache.maven.plugins:maven-antrun-plugin:1.7:run (dist) on project hadoop-kms: An Ant BuildException has occured
编译cdh版hadoop2.5.0出现的问题
系统: CentOs66 64位
JDK:1.7
Maven: 3.0.5
Protobuf: libprotoc 2.5.0
编译命令: mvn package -DskipTests -Pdist,native
****************************************************************************************
[INFO] ------------------------------------------------------------------------
[INFO] Reactor Summary:
[INFO]
[INFO] Apache Hadoop Main ................................ SUCCESS [8.893s]
[INFO] Apache Hadoop Project POM ......................... SUCCESS [4.782s]
[INFO] Apache Hadoop Annotations ......................... SUCCESS [9.500s]
[INFO] Apache Hadoop Assemblies .......................... SUCCESS [2.145s]
[INFO] Apache Hadoop Project Dist POM .................... FAILURE [4.141s]
[INFO] Apache Hadoop Maven Plugins ....................... SKIPPED
[INFO] Apache Hadoop Auth ................................ SKIPPED
[INFO] Apache Hadoop Auth Examples ....................... SKIPPED
[INFO] Apache Hadoop Common .............................. SKIPPED
[INFO] Apache Hadoop NFS ................................. SKIPPED
[INFO] Apache Hadoop Common Project ...................... SKIPPED
[INFO] Apache Hadoop HDFS ................................ SKIPPED
[INFO] Apache Hadoop HttpFS .............................. SKIPPED
[INFO] Apache Hadoop HDFS BookKeeper Journal ............. SKIPPED
[INFO] Apache Hadoop HDFS-NFS ............................ SKIPPED
[INFO] Apache Hadoop HDFS Project ........................ SKIPPED
[INFO] hadoop-yarn ....................................... SKIPPED
[INFO] hadoop-yarn-api ................................... SKIPPED
[INFO] hadoop-yarn-common ................................ SKIPPED
[INFO] hadoop-yarn-server ................................ SKIPPED
[INFO] hadoop-yarn-server-common ......................... SKIPPED
[INFO] hadoop-yarn-server-nodemanager .................... SKIPPED
[INFO] hadoop-yarn-server-web-proxy ...................... SKIPPED
[INFO] hadoop-yarn-server-resourcemanager ................ SKIPPED
[INFO] hadoop-yarn-server-tests .......................... SKIPPED
[INFO] hadoop-yarn-client ................................ SKIPPED
[INFO] hadoop-yarn-applications .......................... SKIPPED
[INFO] hadoop-yarn-applications-distributedshell ......... SKIPPED
[INFO] hadoop-mapreduce-client ........................... SKIPPED
[INFO] hadoop-mapreduce-client-core ...................... SKIPPED
[INFO] hadoop-yarn-applications-unmanaged-am-launcher .... SKIPPED
[INFO] hadoop-yarn-site .................................. SKIPPED
[INFO] hadoop-yarn-project ............................... SKIPPED
[INFO] hadoop-mapreduce-client-common .................... SKIPPED
[INFO] hadoop-mapreduce-client-shuffle ................... SKIPPED
[INFO] hadoop-mapreduce-client-app ....................... SKIPPED
[INFO] hadoop-mapreduce-client-hs ........................ SKIPPED
[INFO] hadoop-mapreduce-client-jobclient ................. SKIPPED
[INFO] hadoop-mapreduce-client-hs-plugins ................ SKIPPED
[INFO] Apache Hadoop MapReduce Examples .................. SKIPPED
[INFO] hadoop-mapreduce .................................. SKIPPED
[INFO] Apache Hadoop MapReduce Streaming ................. SKIPPED
[INFO] Apache Hadoop Distributed Copy .................... SKIPPED
[INFO] Apache Hadoop Archives ............................ SKIPPED
[INFO] Apache Hadoop Rumen ............................... SKIPPED
[INFO] Apache Hadoop Gridmix ............................. SKIPPED
[INFO] Apache Hadoop Data Join ........................... SKIPPED
[INFO] Apache Hadoop Extras .............................. SKIPPED
[INFO] Apache Hadoop Pipes ............................... SKIPPED
[INFO] Apache Hadoop Tools Dist .......................... SKIPPED
[INFO] Apache Hadoop Tools ............................... SKIPPED
[INFO] Apache Hadoop Distribution ........................ SKIPPED
[INFO] Apache Hadoop Client .............................. SKIPPED
[INFO] Apache Hadoop Mini-Cluster ........................ SKIPPED
[INFO] ------------------------------------------------------------------------
[INFO] BUILD FAILURE
[INFO] ------------------------------------------------------------------------
[INFO] Total time: 32.981s
[INFO] Finished at: Sat Nov 12 10:11:28 CST 2016
[INFO] Final Memory: 32M/190M
[INFO] ------------------------------------------------------------------------
编译失败
[ERROR] Failed to execute goal org.apache.maven.plugins:maven-antrun-plugin:1.7:run (dist) on project hadoop-kms:
An Ant BuildException has occured: Can't get http://archive.apache.org/dist/tomcat/tomcat-6/v6.0.43/bin/apache-tomcat-6.0.43.tar.gz
to /home/liuwl/opt/datas/hadoop-2.5.0-cdh5.3.6/hadoop-common-project/hadoop-kms/downloads/apache-tomcat-6.0.43.tar.gz
[ERROR] around Ant part ...<get dest="downloads/apache-tomcat-6.0.43.tar.gz" skipexisting="true" verbose="true"
src="http://archive.apache.org/dist/tomcat/tomcat-6/v6.0.43/bin/apache-tomcat-6.0.43.tar.gz"/>... @ 5:182
in /home/liuwl/opt/datas/hadoop-2.5.0-cdh5.3.6/hadoop-common-project/hadoop-kms/target/antrun/build-main.xml
解决办法
[liuwl@hadoop09-linux-01 /]$ which mvn
/opt/modules/apache-maven-3.0.5/bin/mvn
[liuwl@hadoop09-linux-01 conf]$ vi settings.xml # 修改Maven默认的镜像下载地址,重新解压源码包编译
===========================================================================================
<mirrors>
<mirror>
<id>alimaven</id>
<name>aliyun maven</name>
<url>http://maven.aliyun.com/nexus/content/groups/public/</url>
<mirrorOf>central</mirrorOf>
</mirror>
</mirrors>
结果
[INFO] ------------------------------------------------------------------------
[INFO] Reactor Summary:
[INFO]
[INFO] Apache Hadoop Main ................................ SUCCESS [8.265s]
[INFO] Apache Hadoop Project POM ......................... SUCCESS [4.210s]
[INFO] Apache Hadoop Annotations ......................... SUCCESS [15.404s]
[INFO] Apache Hadoop Assemblies .......................... SUCCESS [2.214s]
[INFO] Apache Hadoop Project Dist POM .................... SUCCESS [6.550s]
[INFO] Apache Hadoop Maven Plugins ....................... SUCCESS [15.752s]
[INFO] Apache Hadoop MiniKDC ............................. SUCCESS [9.598s]
[INFO] Apache Hadoop Auth ................................ SUCCESS [11.524s]
[INFO] Apache Hadoop Auth Examples ....................... SUCCESS [7.462s]
[INFO] Apache Hadoop Common .............................. SUCCESS [3:09.844s]
[INFO] Apache Hadoop NFS ................................. SUCCESS [20.267s]
[INFO] Apache Hadoop KMS ................................. SUCCESS [3:20.595s]
[INFO] Apache Hadoop Common Project ...................... SUCCESS [0.054s]
[INFO] Apache Hadoop HDFS ................................ SUCCESS [5:41.125s]
[INFO] Apache Hadoop HttpFS .............................. SUCCESS [37.255s]
[INFO] Apache Hadoop HDFS BookKeeper Journal ............. SUCCESS [15.759s]
[INFO] Apache Hadoop HDFS-NFS ............................ SUCCESS [7.255s]
[INFO] Apache Hadoop HDFS Project ........................ SUCCESS [0.053s]
[INFO] hadoop-yarn ....................................... SUCCESS [0.086s]
[INFO] hadoop-yarn-api ................................... SUCCESS [1:29.695s]
[INFO] hadoop-yarn-common ................................ SUCCESS [46.448s]
[INFO] hadoop-yarn-server ................................ SUCCESS [0.097s]
[INFO] hadoop-yarn-server-common ......................... SUCCESS [21.099s]
[INFO] hadoop-yarn-server-nodemanager .................... SUCCESS [34.751s]
[INFO] hadoop-yarn-server-web-proxy ...................... SUCCESS [6.165s]
[INFO] hadoop-yarn-server-applicationhistoryservice ...... SUCCESS [11.525s]
[INFO] hadoop-yarn-server-resourcemanager ................ SUCCESS [32.950s]
[INFO] hadoop-yarn-server-tests .......................... SUCCESS [1.377s]
[INFO] hadoop-yarn-client ................................ SUCCESS [11.163s]
[INFO] hadoop-yarn-applications .......................... SUCCESS [0.209s]
[INFO] hadoop-yarn-applications-distributedshell ......... SUCCESS [5.828s]
[INFO] hadoop-yarn-applications-unmanaged-am-launcher .... SUCCESS [3.266s]
[INFO] hadoop-yarn-site .................................. SUCCESS [0.104s]
[INFO] hadoop-yarn-project ............................... SUCCESS [5.477s]
[INFO] hadoop-mapreduce-client ........................... SUCCESS [0.213s]
[INFO] hadoop-mapreduce-client-core ...................... SUCCESS [38.372s]
[INFO] hadoop-mapreduce-client-common .................... SUCCESS [31.908s]
[INFO] hadoop-mapreduce-client-shuffle ................... SUCCESS [7.782s]
[INFO] hadoop-mapreduce-client-app ....................... SUCCESS [20.626s]
[INFO] hadoop-mapreduce-client-hs ........................ SUCCESS [12.265s]
[INFO] hadoop-mapreduce-client-jobclient ................. SUCCESS [9.955s]
[INFO] hadoop-mapreduce-client-hs-plugins ................ SUCCESS [4.040s]
[INFO] hadoop-mapreduce-client-nativetask ................ SUCCESS [1:50.989s]
[INFO] Apache Hadoop MapReduce Examples .................. SUCCESS [11.866s]
[INFO] hadoop-mapreduce .................................. SUCCESS [5.490s]
[INFO] Apache Hadoop MapReduce Streaming ................. SUCCESS [8.804s]
[INFO] Apache Hadoop Distributed Copy .................... SUCCESS [17.052s]
[INFO] Apache Hadoop Archives ............................ SUCCESS [5.487s]
[INFO] Apache Hadoop Rumen ............................... SUCCESS [12.485s]
[INFO] Apache Hadoop Gridmix ............................. SUCCESS [8.274s]
[INFO] Apache Hadoop Data Join ........................... SUCCESS [5.849s]
[INFO] Apache Hadoop Extras .............................. SUCCESS [5.514s]
[INFO] Apache Hadoop Pipes ............................... SUCCESS [10.008s]
[INFO] Apache Hadoop OpenStack support ................... SUCCESS [11.260s]
[INFO] Apache Hadoop Amazon Web Services support ......... SUCCESS [22.069s]
[INFO] Apache Hadoop Azure support ....................... SUCCESS [9.426s]
[INFO] Apache Hadoop Client .............................. SUCCESS [9.233s]
[INFO] Apache Hadoop Mini-Cluster ........................ SUCCESS [1.103s]
[INFO] Apache Hadoop Scheduler Load Simulator ............ SUCCESS [9.421s]
[INFO] Apache Hadoop Tools Dist .......................... SUCCESS [10.727s]
[INFO] Apache Hadoop Tools ............................... SUCCESS [1.466s]
[INFO] Apache Hadoop Distribution ........................ SUCCESS [1:00.845s]
[INFO] ------------------------------------------------------------------------
[INFO] BUILD SUCCESS
[INFO] ------------------------------------------------------------------------
[INFO] Total time: 27:12.777s
[INFO] Finished at: Sat Nov 12 14:31:34 CST 2016
[INFO] Final Memory: 122M/361M
[INFO] ------------------------------------------------------------------------
Failed to execute goal org.apache.maven.plugins:maven-antrun-plugin:1.7:run (dist) on project hadoop-kms: An Ant BuildException has occured的更多相关文章
- maven install Failed to execute goal org.apache.maven.plugins:maven-war-plugin:2.1.1:war (default-war) on project web_nanchang
maven打包成war时,报错:Failed to execute goal org.apache.maven.plugins:maven-war-plugin:2.1.1:war (default- ...
- Failed to execute goal org.apache.maven.plugins:maven-compiler-plugin:3.1:compile (default-compile) on project LogTest: Compilation failure -> [Help 1]
[ERROR] Failed to execute goal org.apache.maven.plugins:maven-compiler-plugin:3.1:compile (default ...
- [ERROR] Failed to execute goal org.apache.maven.plugins:maven-install-plugin:2.3.1:
security-sdk-1.0.jar已经存在于D:/secServerSDK-test/src/main/resources/lib下 报错如下: xxxxxx@xxxxxxxx /d/secSe ...
- [ERROR] Failed to execute goal org.apache.maven.plugins:maven-archetype-plugin:2.4:create (default-cli) on project standalone-pom: Unable to parse configuration of 3: mojo org.apache.maven.plugins:
问题: [ERROR] Failed to execute goal org.apache.maven.plugins:maven-archetype-plugin:2.4:create (defau ...
- [ERROR] Failed to execute goal org.apache.maven.plugins:maven-jar-plugin:2.3.1:jar (default-jar) on
[ERROR] Failed to execute goal org.apache.maven.plugins:maven-jar-plugin:2.3.1:jar (default-jar) on ...
- maven install 报错Failed to execute goal org.apache.maven.plugins:maven-compiler-plugin:3.1:compile (default-compile) on project*****
[ERROR]Failed to execute goal org.apache.maven.plugins:maven-compiler-plugin:3.1:compile (default-co ...
- Maven Failed to execute goal org.apache.maven.plugins:maven-clean-plugin:2.5:clean Failed to delete access_log
I'm trying to run simple struts project using maven and tomcat. When I'm trying to exucute next goal ...
- 解决Failed to execute goal org.apache.maven.plugins
1.Maven构建失败 Failed to execute goal org.apache.maven.plugins:maven-compiler-plugin: 2.3 . 2 :compile ...
- Failed to execute goal org.apache.maven.plugins:maven-compiler-plugin:3.1:compile 解决办法
Maven install失败 Failed to execute goal org.apache.maven.plugins:maven-compiler-plugin:3.1:compile (d ...
随机推荐
- Linux C 文件输入输出函数 fopen()、getc()/fgetc()、putc()/fputc()、fclose()、fprintf()、fscanf()、fgets()、fputs()、fseek()、ftell()、fgetpos()、fsetpos() 详解
fopen(打开文件) 定义函数 FILE * fopen(const char * path,const char * mode); 函数说明 参数path字符串包含欲打开的文件路径及文件名,参 ...
- 利用js刷新页面方法
1,reload 方法,该方法强迫浏览器刷新当前页面. location.reload(force) 如果该方法没有规定参数,或者参数是 false,它就会用 HTTP 头 If-Modified-S ...
- Form 详细属性--2016年12月4日
属性 名称 说明 AcceptButton 获取或设置当用户按 Enter 键时所单击的窗体上的按钮. AccessibilityObject 获取分配给该控件的 Accessib ...
- 使用python列表推导式进行99乘法表
首先这很python for i in range(1, 10): print(" ".join(["%d*%d=%d" % (j, i, i*j) for j ...
- centos7+redis+php环境配置
centos7+redis+php环境配置 下载redis(更多版本可到redis官网进行查找) wget http://download.redis.io/releases/redis-3.0.7. ...
- MysqlWorkbench连接远程数据
- C Primer Plus_第6章_循环_编程练习
1.题略 #include int main(void) { int i; char ch[26]; for (i = 97; i <= (97+25); i++) { ch[i-97] = i ...
- NSString使用stringWithFormat拼接的相关知识
NSString使用stringWithFormat拼接的相关知识 保留2位小数点 1 2 3 4 //.2代表小数点后面保留2位(2代表保留的数量) NSString *string = [NSSt ...
- 关于Qt creator 无法使用fcitx输入中文的问题折腾
环境: 系统ubuntu16.04amd64,qt5.4.2 安装完qt5.4后,在编写代码时,发现无法输入中文,离开qt creator 就立刻正常.原因似乎是qt对fcitx支持. 解决方法我是参 ...
- 【C#】 知乎用户网络爬虫
目的 由一个种子用户出发,抓取相关的关注者和被关注者,然后再延伸开抓取更多的相关用户,以便后期进行数据分析. 拓扑图 开发工具 编程语言:C# 数据库:SqlServer 2008 R2 程序架构 流 ...