整理 node-sass 安装失败的原因及解决办法
npm install 时偶尔遇到报错:没有安装python或node-sass 安装失败的问题,百度之后发现是被墙了,但根据百度的方法换了淘宝镜像和用了vpn都安装失败,最后发现原来是因为没有卸载之前安装失败的包导致的。作者本人最后的解决方案是npm uninstall node-sass,然后使用VPN重新安装了一遍就成功了。不能翻墙的同学请看下文
node-sass 安装失败的原因
npm 安装 node-sass 依赖时,会从 github.com 上下载 .node 文件。由于国内网络环境的问题,这个下载时间可能会很长,甚至导致超时失败。
这是使用 sass 的同学可能都会遇到的郁闷的问题。
解决方案就是使用其他源,或者使用工具下载,然后将安装源指定到本地。
解决方法一:使用淘宝镜像源(推荐)
设置变量 sass_binary_site,指向淘宝镜像地址。示例:
npm i node-sass --sass_binary_site=https://npm.taobao.org/mirrors/node-sass/
// 也可以设置系统环境变量的方式。示例
// linux、mac 下
SASS_BINARY_SITE=https://npm.taobao.org/mirrors/node-sass/ npm install node-sass
// window 下
set SASS_BINARY_SITE=https://npm.taobao.org/mirrors/node-sass/ && npm install node-sass
或者设置全局镜像源:
npm config set sass_binary_site https://npm.taobao.org/mirrors/node-sass/
之后再涉及到 node-sass 的安装时就会从淘宝镜像下载。
解决方法二:使用 cnpm
使用 cnpm 安装 node-sass 会默认从淘宝镜像源下载,也是一个办法:
cnpm install node-sass
解决方法三:创建.npmrc文件
在项目根目录创建.npmrc文件,复制下面代码到该文件。
phantomjs_cdnurl=http://cnpmjs.org/downloads
sass_binary_site=https://npm.taobao.org/mirrors/node-sass/
registry=https://registry.npm.taobao.org
保存后 删除之前安装失败的包(第一次安装请跳过此步)
npm uninstall node-sass
重新安装
npm install node-sass
作者后来另一个项目在没有使用VPN的情况下测试此方法,安装时报错 ERR! node-sass@3.8.0 postinstall: `node scripts/build.js 改用方法一成功。
解决方法四:下载 .node 到本地
到这里去根据版本号、系统环境,选择下载 .node 文件,然后安装时,指定变量 sass_binary_path,如:
npm i node-sass --sass_binary_path=/Users/lzwme/Downloads/darwin-x64-48_binding.node
安装失败后重新安装问题
之前安装失败,再安装就不去下载了,怎么办呢?那就先卸载再安装:
npm uninstall node-sass
npm i node-sass --sass_binary_site=https://npm.taobao.org/mirrors/node-sass/
相关错误提示
提示没有安装python、build失败等,如:
gyp ERR! configure error
gyp ERR! stack Error: Can't find Python executable "C:\Users\zhuon\AppData\Local\Programs\Python\Python36\python.EXE", you can set the PYTHON env variable.
gyp ERR! stack at PythonFinder.failNoPython (G:\Workspace\ManYan\manyan-nav\node_modules\node-gyp\lib\configure.js:483:19)
gyp ERR! stack at PythonFinder.<anonymous> (G:\Workspace\ManYan\manyan-nav\node_modules\node-gyp\lib\configure.js:508:16)
gyp ERR! stack at G:\Workspace\ManYan\manyan-nav\node_modules\graceful-fs\polyfills.js:284:29
gyp ERR! stack at FSReqWrap.oncomplete (fs.js:152:21)
gyp ERR! System Windows_NT 10.0.15063
gyp ERR! command "C:\\dev\\nodejs\\node.exe" "G:\\Workspace\\ManYan\\manyan-nav\\node_modules\\node-gyp\\bin\\node-gyp.js" "rebuild" "--verbose" "--libsass_ext=" "--libsass_cflags=" "--libsass_ldflags="
"--libsass_library="
gyp ERR! cwd G:\Workspace\ManYan\manyan-nav\node_modules\node-sass
gyp ERR! node -v v8.4.0
gyp ERR! node-gyp -v v3.6.2
gyp ERR! not ok
Build failed
npm WARN co-mocha@1.2.0 requires a peer of mocha@>=1.18 <4 but none was installed.
npm WARN egg-restapi-module-tool@1.0.0 No repository field.
npm WARN egg-restapi-module-tool@1.0.0 scripts['server'] should probably be scripts['start'].
npm ERR! code ELIFECYCLE
npm ERR! errno 1
npm ERR! node-sass@3.8.0 postinstall: `node scripts/build.js`
npm ERR! Exit status 1
npm ERR!
整理 node-sass 安装失败的原因及解决办法的更多相关文章
- 整理Mac系统 node-sass 安装失败的原因及解决办法
转载与:https://segmentfault.com/a/1190000010984731 声明:本文非原创,如有侵权请留言或发邮件告知,作者会立即停止侵权并删除本文.发布此文章主要是希望跟作者遇 ...
- (转)整理 node-sass 安装失败的原因及解决办法
转载地址:https://segmentfault.com/a/1190000010984731
- node-sass 安装失败的原因及解决办法
出处:https://segmentfault.com/a/1190000010984731 windows 上用 yarn add node-sass --dev 也可以安装上.
- 360或者金山毒霸可能会导致HP网络打印机驱动安装失败“数据无效”的解决办法
360或者金山毒霸可能会导致HP网络打印机驱动安装失败“数据无效”的解决办法 同事办公室的打印机是网线接口的那种网络打印机,不是直接连到电脑的那种,他电脑安装了360和金山毒霸,WIN10下安 ...
- Windows 2008驱动安装失败的原因及解决方法
希望这些内容能够帮助各位朋友顺利地在Windows Server 2008系统环境下安装使用好各种设备的驱动程序! 寻找安装失败原因 一般来说,当我们将目标设备的驱动安装光盘正确放置到Windows ...
- WinCE启动失败的原因与解决办法分析
本文通过一个真实的嵌入式项目进行说明.文中的嵌入式系统用的是ARM处理器+WinCE平台,项目的目的是要把WinCE平台从旧版本移植到WinCE6.0平台上.但结果是这个WinCE系统在启动的时候经常 ...
- Ajax请求文件下载操作失败的原因和解决办法
使用Poi做excel表格导出功能,第一个想到的就是用Ajax来发送请求,但是Ajax和后台代码都执行了,就是无法下载文件. 前台代码 function exportExl(){ var form = ...
- 用adb pull命令从android系统中读取文件失败的原因及解决办法
问题:使用adb pull命令从android系统中读取文件失败.显示:Permission denied 原因:是由于文件权限原因引起. 使用ls -l命令查看android系统中的 ...
- phpunit安装出错的原因及解决办法
官方指引 很遗憾, phpunit还没有在ArchLinux的仓库里. 所以使用下载安装的方式.按照官方的指引: wget https://phar.phpunit.de/phpunit.phar c ...
随机推荐
- 深入学习c++--左值引用和右值引用
#include <iostream> #include <string> #include <vector> using namespace std; int m ...
- 《Python绝技:运用Python成为顶级黑客》 用Python实现免杀
1.免杀的过程: 使用Metasploit生成C语言风格的一些shellcode作为载荷,这里使用Windows bindshell,功能为选定一个TCP端口与cmd.exe进程绑定在一起,方便攻击者 ...
- iOS开发总结--三方平台开发之分享
1.前言 在公司参与了多个应用三方平台的开发,涉及微信.微博.QQ.Facebook.meetup等,总结一下一般的接入三方平台SDK方法. 2.接入三方SDK 任何应用要接入三方平台,都需要在该平台 ...
- Python小白学习之路(十九)—【文件操作步骤】【文件操作模式】
一.文件操作步骤 step1:打开文件,得到文件句柄并赋值给一个变量step2:通过句柄对文件进行操作step3:关闭文件 举例: a = open('hello world', 'r', encod ...
- Swift的Guard语句
与if语句相同的是,guard也是基于一个表达式的布尔值去判断一段代码是否该被执行.与if语句不同的是,guard只有在条件不满足的时候才会执行这段代码.你可以把guard近似的看做是Assert,但 ...
- 剑指offer二十三之二叉搜索树的后序遍历序列
一.题目 输入一个整数数组,判断该数组是不是某二叉搜索树的后序遍历的结果.如果是则输出Yes,否则输出No.假设输入的数组的任意两个数字都互不相同. 二.思路 1.二叉搜索树又称二叉排序树(Binar ...
- [转]asp.net core中的View Component
解读ASP.NET 5 & MVC6系列(14):View Component http://www.cnblogs.com/TomXu/p/4496486.html
- Android 开发服务类 03_ServletForGETMethod
接收并处理用户通过 GET 方式上传的数据,一般小于 2K,并且安全性要求不高. package com.wangjialin.internet.servlet; import java.io.IOE ...
- InnoSetup打包时出现Interal error: CallSpawnServer: Unexpected response: $0.错误的解决办法
如果在使用Innosetup打包软件时,如果出现Interal error: CallSpawnServer: Unexpected response: $0.错误, 如下图: 可以查看 Innose ...
- C#中给滚动条增加鼠标滚动轮控制事件
当滚动条的父控件获得焦点时,可以使用鼠标的滚动轮来控制滚动条 public partial class Form1 : Form { public Form1() { InitializeCompon ...