首先必须降低gcc版本:

sudo apt-get install gcc-4.4
sudo apt-get install g++-4.4
sudo rm -rf /usr/bin/gcc /usr/bin/g++
sudo ln -s /usr/bin/gcc-4.4 /usr/bin/gcc
sudo ln -s /usr/bin/g++-4.4 /usr/bin/g++

 

 

################ Fix 1 ##########################

Error:

frameworks/base/include/utils/KeyedVector.h:193:31: note: declarations in dependent base 'android::KeyedVector<android::String8, android::sp<AaptDir> >' are not found by unqualified lookup

frameworks/base/include/utils/KeyedVector.h:193:31: note: use 'this->indexOfKey' instead

make: *** [out/host/linux-x86/obj/EXECUTABLES/aapt_intermediates/AaptAssets.o] Error 1

Fix:
vi frameworks/base/tools/aapt/Android.mk

Add '-fpermissive' to line 31:
LOCAL_CFLAGS += -Wno-format-y2k -fpermissive

################## Fix 2 ##########################

Error:

frameworks/base/include/utils/KeyedVector.h:193:31: error: 'indexOfKey' was not declared in this scope, and no declarations were found by argument-dependent lookup at the point of instantiation [-fpermissive]

frameworks/base/include/utils/KeyedVector.h:193:31: note: declarations in dependent base 'android::KeyedVector<android::String8, android::wp<android::AssetManager::SharedZip> >' are not found by unqualified lookup

frameworks/base/include/utils/KeyedVector.h:193:31: note: use 'this->indexOfKey' instead

make: *** [out/host/linux-x86/obj/STATIC_LIBRARIES/libutils_intermediates/AssetManager.o] Error 1

Fix:
vi frameworks/base/libs/utils/Android.mk

Add '-fpermissive' to line 64:
LOCAL_CFLAGS += -DLIBUTILS_NATIVE=1 $(TOOL_CFLAGS) -fpermissive

 

问题三
external/srec/tools/thirdparty/OpenFst/fst/lib/cache.h:132:26: note: declarations in dependent base 'fst::VectorFstBaseImpl<fst::CacheState<fst::GallicArc<fst::StdArc, (fst::StringType)0u> > >' are not found by unqualified lookup
external/srec/tools/thirdparty/OpenFst/fst/lib/cache.h:132:26: note: use 'this->SetState' instead
external/srec/tools/thirdparty/OpenFst/fst/lib/cache.h:136:61: error: 'SetState' was not declared in this scope, and no declarations were found by argument-dependent lookup at the point of instantiation [-fpermissive]
SetState(cache_first_state_id_, cache_first_state_);

make: *** [out/host/linux-x86/obj/EXECUTABLES/grxmlcompile_intermediates/grxmlcompile.o] Error 1

解决办法:
cd external/srec
wget "https://github.com/CyanogenMod/android_external_srec/commit/4d7ae7b79eda47e489669fbbe1f91ec501d42fb2.diff"
patch -p1 < 4d7ae7b79eda47e489669fbbe1f91ec501d42fb2.diff
rm -f 4d7ae7b79eda47e489669fbbe1f91ec501d42fb2.diff
cd ../..

此方法是我找的别人对于4.0版本源码问题的解决方法,我用在了2.3上,没有出现问题

dalvik_system_Zygote.c:191:19: error: storage size of 'rlim' isn't known

解决办法
添加头文件#include <sys/resource.h>到以下文件
dalvik/vm/native/dalvik_system_Zygote.cpp 

 

<command-line>:0:0: error: "_FORTIFY_SOURCE" redefined [-Werror]

解决办法
gcc和g++版本太高了
sudo apt-get install gcc-4.4
sudo apt-get install g++-4.4
sudo rm -rf /usr/bin/gcc /usr/bin/g++
sudo ln -s /usr/bin/gcc-4.4 /usr/bin/gcc
sudo ln -s /usr/bin/g++-4.4 /usr/bin/g++

 

Can't locate Switch.pm in @INC (you may need to install the Switch module) (@INC

 contains: external/webkit/WebCore/bindings/scripts /etc/perl /usr/local/lib/per

l/5.18.2 /usr/local/share/perl/5.18.2 /usr/lib/perl5 /usr/share/perl5 /usr/lib/p

erl/5.18 /usr/share/perl/5.18 /usr/local/lib/site_perl .) at external/webkit/Web

Core/dom/make_names.pl line 38.

BEGIN failed--compilation aborted at external/webkit/WebCore/dom/make_names.pl l

ine 38.

Can't locate Switch.pm in @INC (you may need to install the Switch module) (@INC

 contains: external/webkit/WebCore/bindings/scripts /etc/perl /usr/local/lib/per

l/5.18.2 /usr/local/share/perl/5.18.2 /usr/lib/perl5 /usr/share/perl5 /usr/lib/p

erl/5.18 /usr/share/perl/5.18 /usr/local/lib/site_perl .) at external/webkit/Web

Core/dom/make_names.pl line 38.

BEGIN failed--compilation aborted at external/webkit/WebCore/dom/make_names.pl l

ine 38.

 

解决方法是安装perl的switch库:

[plain] view plaincopy

  1. sudo apt-get install libswitch-perl  

在ubuntu 14.04 编译android 2.3.1 错误解决办法的更多相关文章

  1. [原]Ubuntu 14.04编译Android Kernel

    如何编译android kernel参考官方文档:https://source.android.com/source/building-kernels.html   在Ubuntu 14.04上编译a ...

  2. Ubuntu 14.04 编译 Android 4.2.2 for Tiny4412

    . . . . . 在学校里是用 Redhat 6.4 编译的 Android 4.2.2 很顺利,把源码包拷贝到笔记本上的 Ubuntu 14.04 上再编译遭遇了各种坑,所以便有了这篇博客记录解决 ...

  3. Ubuntu(64位)编译Android源码常见错误解决办法

    2013年07月10日 14:47:27 阅读数:1239 错误: /usr/include/gnu/stubs.h:7:27: error: gnu/stubs-32.h: No such file ...

  4. Ubuntu 14.04 下 android studio 安装 和 配置【转】

    本文转载自:http://blog.csdn.net/xueshanfeihu0/article/details/52979717 Ubuntu 14.04 下 android studio 安装 和 ...

  5. 【转】Ubuntu 上编译Android出现cannot find -lstdc++解决办法

    [转]Ubuntu 上编译Android出现cannot find -lstdc++解决办法 在Ubuntu 12.04 x86_64机器上编译Android出现下面错误,是因为找不到32bit的li ...

  6. 使用 EasyBCD 安装Ubuntu 14.04 Error 15: file not found错误的解决方法

    今天安装Window7 和 Ubuntu 14.04 双系统时,出现如下异常,记录一下. 安装过程是参考 http://www.linuxidc.com/Linux/2014-04/100369.ht ...

  7. ubuntu 14.04 编译安装 nginx

    下载源码包 nginx 地址:http://nginx.org/en/download.html  下载nginx 1.4.7 编译前先安装两个包: 直接编译安装会碰到缺少pcre等问题,这时候只要到 ...

  8. VirtualBox4.3.12 安装ubuntu 14.04 分辨率过小(600*480)问题的解决方法

    作为.net程序员,一直都跟windows系统打交道,在同事的影响下,今天安装了Ubuntu 14. 安装完系统就遇到了这个麻烦事,找了好久才解决,因此记录下来,或许对和我一样的Ubuntu新手有帮助 ...

  9. ubuntu 14.04编译安装xen4.4总结

    1. 安装环境 操作系统:ubuntu14.04 xen版本:xen4.4 2. 依赖包的安装 在安装xen之前先进行依赖包的安装,在不停得尝试之后,总结出以下需要安装的依赖包. sudo apt-g ...

随机推荐

  1. 聊聊 SQL Joins

    SQL 中的 Join 有以下几种类型: 1.Cross Join 交叉连接,没有条件筛选,返回笛卡尔积. 如果以 ,(逗号)分隔表名进行查询如 select * from tbl_name1, tb ...

  2. Mongodb 分片与副本集

    测试搭建192.168.3.110mongos 30000,30001,30002config 40000,40001,40002shard1 50001,50002,50003shard2 5000 ...

  3. Python多进程-进程间数据的共享

    不同的进程不能同时修改一份数据,但是不同的进程能对一份数据进行修改 可通过Manager来实现进程间的数据共享 # -*- coding:utf-8 -*- __author__ = "Mu ...

  4. 清除SUN服务器部件的suspect状态

    对于suspect状态的部件,可以用setchs命令清除其状态.如果ScApp的版本在5.20.15之前,需要进入service模式后才能使用setchs命令.如果ScApp版本 升级到5.20.15 ...

  5. 服务器启动时Webapp的web.xml中配置的加载顺序

    一 1.启动一个WEB项目的时候,WEB容器会去读取它的配置文件web.xml,读取<listener>和<context-param>两个结点. 2.紧急着,容创建一个Ser ...

  6. javascipt——基础知识——基本数据类型和逻辑运算

    进制转换:http://www.topthink.com/topic/504.html javascript的数据类型分为基本数据类型和非基本数据类型(对象) 一.基本数据类型: 包括以下部分:数字. ...

  7. django之admin组件

    一.面向对象复习 1.类的继承 class Base(object): def __init__(self,val): self.val = val def func(self): self.test ...

  8. mysql:mysql Access denied for user root@

    最近用本地Navicat连接集群的mysql,报了上述的错误,我认为是权限问题 之前试过赋权限给所有人,但是我这边还是连接不上,无奈,试试只分给我一个IP 开始:mysql -uroot -p //先 ...

  9. C/C++下测量函数运行时间

    C/C++下测量函数运行时间 time.h介绍 C/C++中的计时函数是clock(),而与其相关的数据类型是clock_t. clock_t clock( void ); 这个函数返回从" ...

  10. warning: control reaches end of non-void function 和 warning: implicit declaration of function 'rsgClearColor' is invalid in C99

    用gcc编译一个程序的时候出现这样的警告: warning: control reaches end of non-void function 它的意思是:控制到达非void函数的结尾.就是说你的一些 ...