关于人人开源renren-fast-vue 中npm install各种报错的解决方案
首先吐槽一下,因为这个问题我整了好几天,把报错信息复制百度,试遍了各种方法,node.js我是卸载了安装,安装了卸载,甚至renren-fast-vue我也删了再下,然后再删,无限循环。然而没有什么软用,我太难了。。
1.一般大部分报错都是报的node-sass安装失败
2.解决办法:如果你之前安装失败过的,请先清理缓存
使用命令:
npm rebuild node-sass
npm uninstall node-sass
3.之后执行:
npm i node-sass --sass_binary_site=https://npm.taobao.org/mirrors/node-sass/
执行成功后看看有没有报错,要是没有报错就可以执行安装命令了
4.安装
npm install
npm run dev
果然很简单就能解决,为什么我不早早的发现那篇文章呢,我都把python换了好几个版本进行安装了,啊!!
额外,小编我科普一下node-sass是干什么的(偷偷告诉你,我之前也不知道干啥的,毕竟我是一个实实在在的后端开发人员,前端那些东西懂得还真没那么多),
|
敲黑板时间: Node-sass是一个库,它将Node.js绑定到LibSass(流行样式表预处理器Sass的C版本)。它允许用户以令人难以置信的速度将.scss文件本地编译为css,并通过连接中间件自动编译。 Sass是一种预处理器脚本语言,可以解释或编译成层叠样式表(CSS)。 Sass包含两种语法:较旧的语法使用缩进将代码块和换行符分隔为单独的规则;较新的语法SCSS使用像CSS这样的块格式。它使用大括号来表示代码块和分号来分隔块中的行。 缩进语法和SCSS文件传统上分别给出扩展名.sass和.scss |
接下来,可以继续学习我的《微服务分布式谷粒商城电商项目》了!!
已经停滞了好几天没能进行下去了,奋起直追,加油zae!!!
解决方案出处链接:https://www.jianshu.com/p/2be02670484e
关于人人开源renren-fast-vue 中npm install各种报错的解决方案的更多相关文章
- npm install 安装报错:npm ERR! EPERM npm ERR! -4048 npm ERR! Error: EPERM: operation not permitted, unlink 'D:\test\demo\code\materialT\node_modules\.staging'
更新项目依赖包,删除掉package-lock.json.node_modules,运行npm install,报如上错误信息,查询资料说是没有权限,本人用管理员身份打开powershell,运行np ...
- axios 异步加载 导致 {{}} 中变量为 undefined 报错 的 解决方案
情景:axios 异步加载数据,当返回数据为一个 数组 时,双花括号中 这样写 会报错 {{informationDetail[0].img}} 解决方案一:通过 v-if 进行判断 解决方案二:单独 ...
- Vue中npm run build报“Error in parsing SVG: Unquoted attribute value”
自己做的一个Vue项目,在打包时老是报这个错误 # Error in parsing SVG: Unquoted attribute value 查了查网上说的,都说报错原因是压缩和抽离CSS的插件中 ...
- vue中npm install 报错之一
报错原因: 这是因为文件phantomjs-2.1.1-windows.zip过大,网络不好,容易下载失败 PhantomJS not found on PATH 解决方案一: 选择用cnpm ins ...
- vue中更换.ico图标报错路径找不到图片
问题描述: vue项目中,想要更换.ico图片,更换完成后刷新页面报错,找不到路径. 解决: 更换完图片,重新启动下vue项目(npm run dev)就可以啦~ 哈哈哈 补充知识: 网页title旁 ...
- vue 中安装使用sass 报错遇到的问题整理
不出错的情况下,正常安装: 1.安装包: npm install node-sass --save-dev npm install sass-loader --save-dev (sass-loade ...
- vue项目npm run dev 报错error in ./src/main.js Module build failed: Error: Cannot find module 'babel-plugin-syntax-jsx'
问题: vue 项目npm run dev运行时报错,如下图: 原因: 缺少相应的组件 解决办法: 安装相应组件: npm install babel-plugin-syntax-jsx --sav ...
- vue项目npm run dev 报错error in ./src/main.js Module build failed: ReferenceError: Unknown plugin "transform-vue-jsx" specified in......
问题: vue项目npm run dev运行时报错,如下图: 原因: 缺少组件 解决办法: 安装相应的组件: npm install babel-plugin-transform-vue-jsx ...
- vue 运行npm run dev报错
npm run dev运行时报错,原因有很多. 一般用下面这种方法都能解决的. 最简单粗暴的方法: 1.删除依赖包node_modules 2.然后重新npm install就行了 (如果这步报错了, ...
随机推荐
- 问卷星的数据导入spss后变量乱码如何处理?
一般是字符编码问题.打开一个空的SPSS数据集,选择[编辑]-[选项]-[常规]-[数据和语法的字符编码].修改下当前的编码系统,原来是第一种就换成第二种,原来是第二种就换成第一种,打开一个数据再看看 ...
- PL/SQL语言基础
PL/SQL语言基础 进行PL/SQL编程前,要打开输出set serveroutput on 1.创建一个匿名PL/SQL块,将下列字符输出到屏幕:"My PL/SQL Block Wor ...
- aop思想以及环境搭建(记录自己的一小步)1.1
##什么是aop思想? 首先老办法我们一起先看看官网是咋描述的? 它利用一种称为"横切"的技术,剖解开封装的对象内部,并将那些影响了多个类的公共行为封装到一个可重用模块,并将其名为 ...
- sha1sum校验方法
sha1sum校验方法,我们可以保存到一个文件中.还可以根据已经得到的hash来确认文件.MD5类似. [root@ffcs211 test_dir]# sha1sum New.EXE 3fe44e8 ...
- 《52讲轻松搞定网络爬虫》读书笔记 - Session和Cookie
为什么要用Session和Cookie? 简单一句话,因为Session和Cookie可以记录用户状态信息 嘶..这到底啥意思呢? 背景一:动态网页的出现 什么是静态网页 含义:一个网页的内容是HTM ...
- Unity报与System.IO相关的错误
比如这个: Type `System.IO.FileInfo' does not contain a definition for `OpenText' and no extension method ...
- windows下TOMCAT对内存使用的设置
1.打开TOMCAT目录 E:\备份\apache-tomcat-8.5.50-windows-x64\apache-tomcat-8.5.50\bin catalina.bat----------- ...
- Codeforces Round #571 (Div. 2)-D. Vus the Cossack and Numbers
Vus the Cossack has nn real numbers aiai. It is known that the sum of all numbers is equal to 00. He ...
- JS中有趣的内置对象-JSON
前言 在以前的web开发中,我们多数选择纯文本或XML作为我们的提交的数据格式,大多数是XML,少数纯文本.其实从AJAX(Asynchronous JavaScript and XML)的命名我们也 ...
- STS 使用lombox.jar
在Maven本地仓库中找到 将lombox.jar放在与STS.exe平级的目录下, 然后安装完了以后可能会出先打不开的情况.这个时候只要打开STS.ini文件. 然后修改文件保存