报错信息如下:

:app:installDebug

Installing APK 'app-debug.apk' on 'Redmi 3S - 6.0.1'
Unable to install D:\ReactNative-Workspace\FirstRNProject\android\app\build\outp
uts\apk\app-debug.apk
com.android.ddmlib.InstallException: Failed to establish session
at com.android.ddmlib.Device.installPackages(Device.java:894)
at com.android.builder.testing.ConnectedDevice.installPackages(Connected
Device.java:113)

........ 中间一大堆报错信息省略 .........

:app:installDebug FAILED

FAILURE: Build failed with an exception.

What went wrong:
Execution failed for task ':app:installDebug'.
com.android.builder.testing.api.DeviceException: com.android.ddmlib.InstallExc
eption: Failed to establish session

一直跳错误信息:

解决过程:手机型号(红米3S,系统MIUI 8);先检查了一下开发者选项,USB调试、未知源 都是开启的;

然后发现 “启用MIUI优化”这一项是开启的,把它关掉(设置----更多设置----开发者选项----启用MIUI优化 关闭)

image.png

解决React Native安装应用到真机(红米3S)报Execution failed for task ':app:installDebug'的错误的更多相关文章

  1. 【React Native错误集】* What went wrong: Execution failed for task ':app:installDebug'.

    错误1:* What went wrong: Execution failed for task ':app:installDebug'. > com.android.builder.testi ...

  2. Android Studio Error:Execution failed for task ':app:preDebugAndroidTestBuild'.彻底解决的方法以及修改AScompileSDKVersion

    Error Error:Execution failed for task ':app:preDebugAndroidTestBuild'. > Conflict with dependency ...

  3. 关于android studio 出现Error:Execution failed for task ':app:preDebugAndroidTestBuild'. 的解决办法

    Error:Execution failed for task ':app:preDebugAndroidTestBuild'. > Conflict with dependency 2018年 ...

  4. Error:Execution failed for task ':app:preDebugAndroidTestBuild'.错误解决

    在新建布局文件的时候,页面显示: design editor is unavailable until a successful build(设计编辑器不可用,直到成功创建.) 细看下面还有一行错误: ...

  5. 我的Android进阶之旅------>解决:Execution failed for task ':app:transformResourcesWithMergeJavaResForDebug'.

    错误描述 今天在Android Studio项目中加入了jackson的开发包,编译运行时候,引发了如下的错误: Error:Execution failed for task ':app:trans ...

  6. Android 解决Execution failed for task ':app:clean.'报错

    说实话,我还真是没见过比Execution failed for task ':app:clean.'更为恶心,更为不要脸的bug啦,代码没啥问题,一下子行让你爽爽,一下子又不鸟你啦,研究了下,终于找 ...

  7. 安卓中运行报错Error:Execution failed for task ':app:transformClassesWithDexForDebug'解决

    在androidstuio中运行我的未完项目,报错: Error:Execution failed for task ':app:transformClassesWithDexForDebug'.&g ...

  8. react native ios打包到真机

    每当在模拟器上完成了开发,都想到真机上秀秀,正好前段时候买了一个mac,哈哈有机会了.前篇文章以android为例,这里就以ios为例,讲一下打包到iphone真机的流程. 一.前置 1.首先你得有一 ...

  9. react native ios打包到真机,即生产包

    参考文章:http://www.devio.org/2017/02/09/React-Native%E5%8F%91%E5%B8%83APP%E4%B9%8B%E6%89%93%E5%8C%85iOS ...

随机推荐

  1. 看完这篇还不懂Redis的RDB持久化,你们来打我!

    一.为什么需要持久化 redis里有10gb数据,突然停电或者意外宕机了,再启动的时候10gb都没了?!所以需要持久化,宕机后再通过持久化文件将数据恢复. 二.优缺点 1.rdb文件 rdb文件都是二 ...

  2. [JavaWeb基础] 025.JAVA把word转换成html

    用第三方插件POI把word文档转换成HTML,下面直接上代码 package com.babybus.sdteam.wordtopdf; import java.io.BufferedWriter; ...

  3. [Objective-C] 017_UI篇_UIView(中)

    在上篇我们简单讲了UIView的坐标与几何结构,这篇我们来实战UIView一下.UIView在App中有着绝对重要的地位,因为可视化控件几乎都是UIView的子类.在App负责渲染区域的内容,并且响应 ...

  4. Nexus Repository Manager 3(CVE-2019-7238) 远程代码执行漏洞复现

    0x00 漏洞背景 Nexus Repository Manager 3是一款软件仓库,可以用来存储和分发Maven,NuGET等软件源仓库.其3.14.0及之前版本中,存在一处基于OrientDB自 ...

  5. ES6-变量let和常量const

    1.以往js变量 var 1.可以重复声明 2.无法限制修改(指不能声明常量) 3.没有块级作用域(指{}这样的) 2.现在ES6变量 let 不能重复声明-变量,可以修改,块级作用域 const 不 ...

  6. Chisel3 - util - LFSR16

    https://mp.weixin.qq.com/s/DSdb4tmRwDTOki7mbyuu9A     实现16位线性反馈移位寄存器.可用于生成简单的伪随机数.     ​​     ​​   参 ...

  7. Shell脚本 (三) 条件判断 与 流程控制

    个人博客网:https://wushaopei.github.io/    (你想要这里多有) 六.条件判断 1.基本语法 [ condition ](注意condition 前后要有空格) 注意:条 ...

  8. 一个request请求然后锁定等待异步接口处理结果

    private ConcurrentHashMap<String, Locker> relation = new ConcurrentHashMap<String, Locker&g ...

  9. Java实现 LeetCode 771 宝石与石头(这是真暴力)

    771. 宝石与石头 给定字符串J 代表石头中宝石的类型,和字符串 S代表你拥有的石头. S 中每个字符代表了一种你拥有的石头的类型,你想知道你拥有的石头中有多少是宝石. J 中的字母不重复,J 和 ...

  10. Java实现 蓝桥杯VIP 算法训练 寂寞的数

    问题描述 道德经曰:一生二,二生三,三生万物. 对于任意正整数n,我们定义d(n)的值为为n加上组成n的各个数字的和.例如,d(23)=23+2+3=28, d(1481)=1481+1+4+8+1= ...