Xcode真机报错clang: error: linker command failed with exit code 1 (use -v to see invocation)
出现这种错误,如下图所示,搜索bitcode,置为NO即可.

Xcode真机报错clang: error: linker command failed with exit code 1 (use -v to see invocation)的更多相关文章
- clang: error: linker command failed with exit code 1 (use -v to see invocation)
报错提示: ... ld: 6 duplicate symbols for architecture x86_64 clang: error: linker command failed with e ...
- 使用SVN clang: error: linker command failed with exit code 1 (use -v to see invocation)
然后上传到该项目SVN仓库上,例如,下面的错误再次发生再拉到本地编译 ld: library not found for -lxxxxxxxxxxxx clang: error: linker com ...
- "_OBJC_CLASS_$_ALAssetsLibrary", referenced from:和clang: error: linker command failed with exit code 1 (use -v to see invocation)错误
在项目中使用MWPhotoBrowser未导入ALAssetsLibrary类库时会导致编译时出现异常: "_OBJC_CLASS_$_ALAssetsLibrary", refe ...
- iOS cocoapods导入项目 出现 "___gxx_personality_v0", referenced from: 或者 clang: error: linker command failed with exit code 1 (use -v to see invocation) 错误
今天想导入PNChart 编译的时候出现了 "___gxx_personality_v0", referenced from: 和 clang: error: linker c ...
- clang: error: linker command failed with exit code 1 (use -v to see invocation) 无法定位的问题
编译出现错误:linker command failed with exit code 1 找到Build settings->Linking->Other Linker Flags,将此 ...
- Apple Mach-O Linker Error Group 与 "_OBJC_CLASS_$_XXXXXX", referenced from: 和 clang: error: linker command failed with exit code 1 (use -v to see invocation) 问题.
此问题为链接报错,在Build Settings中的Other Linker Flags添加:-l"XXXXXX"
- ios clang: error: linker command failed with exit code 1 (use -v to see invocation)解决方法
当xcode编译时出现这个错误,一般是你的编译源码中存在重复的源码 解决方法:"Build Phases" -> "Compile Sources" 去删 ...
- 解决了clang: error: linker command failed with exit code 1 (use -v to see invocation) 解决方法
1.”Build Settings”->”Enable Bitcode”设置为NO 2.TARGETS --> Build Settings --> Architectures - ...
- svn中第一次check out working copy项目下来出现 ld: library not found for -lcrypto clang: error: linker command failed with exit code 1 (use -v to see invocation)
这个问题主要是.a文件的忽略删除,需要更改设置,并且把文件重新添加
随机推荐
- Javac可以编译,Java显示找不到或无法加载主类
运行时候加入完整包名.
- fullpage.js最后一屏不满一屏时,滚动方式
这两天公司网页改版用到fullpage.js这个滚屏插件,页面内容整屏的滚动,不成问题,各种设置在网上也都有文档.而我遇到的问题就是,页面内容不满屏的时候,和上面的内容放一块就太挤,单独放一屏就太空, ...
- JAVA-产生唯一32位GUID
import java.net.*; import java.util.*; import java.security.*; import org.apache.log4j.Logger; /** * ...
- 浅析flex 布局
Flex基本概念: 容器默认存在两根轴:水平的主轴(main axis)和垂直的交叉轴(cross axis).主轴的开始位置(与边框的交叉点)叫做main start,结束位置叫做main end: ...
- 【BD2】- Linux安装db2 v11.1
一.背景 项目需要兼容多种数据库oracle.mysql.db2.KingDB等等...... 自己在阿里云买的服务器安装测试...... 二.记录安装过程 1.创建db2目录 [root@ysx y ...
- Module parse failed: Export 'instance' is not defined (35:19)
Module parse failed: Export 'instance' is not defined (35:19) 使用npm出现的这错误,用yarn就可以了 这种情况rm node_modu ...
- codeforces340C
Tourist Problem CodeForces - 340C Iahub is a big fan of tourists. He wants to become a tourist himse ...
- elastic search&logstash&kibana 学习历程(一)es基础环境的搭建
elastic search 6.1.x 常用框架: 1.Lucene Apache下面的一个开源项目,高性能的.可扩展的工具库,提供搜索的基本架构: 如果开发人员需用使用的话,需用自己进行开发,成本 ...
- axios的post请求方式,怎么把参数直接加在URL后面,不用payload
export const delUser = (id) => { return axios.post("/user/remove", null, { params:{ id, ...
- 微信小程序_(表单组件)button组件的使用
微信小程序表单组件button官方文档 传送门 Learn 一.button组件的使用 一.button组件的使用 size:按钮的大小[默认值default] type:按钮的样式类型[默认值def ...