Java Error: Failed to validate certificate. The application will not be executed
Hi,
last week a customer had the problem that he wants to connect to the administration interface of a Brocade FC Switch but the Java Applet did not start. This error message was shown: “Failed to validate certificate. The application will not be executed”
Failed to validate certificate. The application will not be executed
A detailed look into the certificate shows that a signature algorithm MD2withRSA was used to create it.
Java Certificate error
Java certificate details
MD2 is disabled in java by default also a RSA key with less then 1024bits. Because these are no longer considered as secure and therefore java reject such certificates.
You can disable this check, because you have start the applet to access your FC Switch. Locate the file java.security in the lib/security folder of your java installation and comment the following[注释掉下面一行,同时在javacontrol中增加例外]:
# jdk.certpath.disabledAlgorithms=MD2, RSA keySize < 1024
The applet should start now but for security reasons it is recommended to reverse this change if it is no longer needed.
Michael
Java Error: Failed to validate certificate. The application will not be executed的更多相关文章
- 打开jnlp Faild to validate certificate, the application will not be executed.
今天连jenkins, 本来好好的,只是我在一台机器上一直不断的启动不同的jnlp,绑定不同命名的slave, 然后突然就报错了, 如下截图所示:
- idea报错:error java compilation failed internal java compiler error
idea下面报如下问题 error java compilation failed internal java compiler error 解决办法:Setting->Compiler-> ...
- idea Error:java: Compilation failed: internal java compiler error
idea 遇到Error:java: Compilation failed: internal java compiler error 是提示说你当前使用的编译器jdk版本不对. 按住Ctrl+Alt ...
- Error:java:Compilation failed: internal java compiler error
在IDEA中编译时出现这个错误:Error:java:Compilation failed: internal java compiler error! Information:Using javac ...
- idea中解决Error:java: Compilation failed: internal java compiler error的问题
项目中,使用gradle做项目构建,当我们想更改JDK的版本时,报以下错误: Information:Using javac 1.8.0_111 to compile java sourcesInfo ...
- IntelliJ IDEA 运行错误:java: Compilation failed: internal java compiler error
错误:java: Compilation failed: internal java compiler error 解决的方法: 文件 --> 设置 : 若没有模块,点击右边的把自己项目的模块添 ...
- Java异常 | Error:java: Compilation failed: internal java compiler error
背景 今天网上下载了一个项目,编辑运行报如下异常: Error:java: Compilation failed: internal java compiler error 经过往经验,读项目的编译环 ...
- scala安装遇到的问题:[ERROR] Failed to construct terminal; falling back to unsupported java.lang.NumberFormatException: For input string: "0x100"
安装scala时遇到的问题 lion@king:/opt$ scala Welcome to Scala 2.11.12 (Java HotSpot(TM) 64-Bit Server VM, Jav ...
- java: Compilation failed: internal java compiler error
IDEA 编译项目出现java: Compilation failed: internal java compiler error 原因: 项目Java版本不一致 解决办法: 点击FIle> ...
随机推荐
- Java8新特性(一)——Lambda表达式与函数式接口
一.Java8新特性概述 1.Lambda 表达式 2. 函数式接口 3. 方法引用与构造器引用 4. Stream API 5. 接口中的默认方法与静态方法 6. 新时间日期 API 7. 其他新特 ...
- 【转】mysql索引最左匹配原则的理解
作者:沈杰 链接:https://www.zhihu.com/question/36996520/answer/93256153 来源:知乎 CREATE TABLE `student` ( `id` ...
- AWS安装CDH5.3-CentOS6.4
1.下载CM启动文件 [root@ip-172-31-23-107 ec2-user]# wget http://archive.cloudera.com/cm5/installer/latest/c ...
- 思杰VDI提示“The VDI is not available”
前言:困扰已久的问题终于解决. 问题:客户反馈无法连接VDI. 解决过程:1.登录后台查看VDI状态为关机状态尝试重新启动提示如下图: 2.判断此VDI的启动盘出现问题(注:本人环境无数据盘) 3.查 ...
- EFT4 生成实体类
创建T4模本拷贝以下代码 <#@ template language="C#" debug="false" hostspecific="true ...
- Git 使用 粗糙记录
版本控制应该是每一个开发人员应该会的东西,奈何,学校没有学习,随着写代码的时间的加长,越来月觉得版本控制的必要性了. 记得在实习的公司,同一痛的都是SVN. 至于GIt和SVN的区别,直接看连接 ht ...
- python学习总结----简单数据结构
mini-web服务器 - 能够完成简单的请求处理 - 使用http协议 - 目的:加深对网络编程的认识.为后面阶段学习web做铺垫 简单数据结构 - 排列组合 import itertools # ...
- nopcommerce商城系统--安装nopCommerce
原址:http://www.nopcommerce.com/docs/79/installing-nopcommerce.aspx .NET Framework 4.5.1下载:http://www. ...
- ArcGIS API for JavaScript使用中出现的BUG(1)
本人在使用ArcGIS API for JavaScript开发一个地图的搜索框时,总是出现一个BUG.如图所示: 搜索框总是出不来. 该引用的也引用了,找了半天终于解决,是因为路径没有定义详细. 应 ...
- tomcat 启动报错 解决办法 A child container failed during
控制台报错: Caused by: org.apache.catalina.LifecycleException: A child container failed during start at o ...