maven的单元测试中没有
原因:BaseTest没有找到单元测试造成的
增加一个空的单元测试
@Test
public void testNothing(){
} 异常现象:
在maven项目执行mvn install 或mvn test时报错: ERROR] Please refer to 目录/target/surefire-reports for the individual test results. 或者是运行单个单元测试时出现:java.lang.Exception: No runnable methods
本质一样。
-------------------------------------------
其他回答:
异常1:
[ERROR] Failed to execute goal on project biz_zhuhai: Could not resolve dependencies for project biz_zhuhai:biz_zhuhai:jar:0.0.1-SNAPSHOT: Failed to collect dependencies for [com.maywide.ibh:lib345:pom:1.0 (compile)]: Failed to read artifact descriptor for com.maywide.ibh:lib345:pom:1.0: Could not transfer artifact com.maywide.ibh:lib345:pom:1.0 from/to releases (http://localhost:9888/nexus-2.0.3/content/repositories/releases): Connection to http://localhost:9888 refused: Connection refused: connect -> [Help 1]
解决方法:
这是配置的url有错误或者是私服没有配好,导致构件下载时出错。如果没有jar包需要在私服里下载,可以不配置私服的,也就是可以把setting.xml的profiles里的东西全部删除的。
异常2:
[ERROR] Failed to execute goal org.apache.maven.plugins:maven-surefire-plugin:2.10:test (default-test) on project web_nanchang: There are test failures.
[ERROR]
[ERROR] Please refer to E:\maven\web_nanchang\target\surefire-reports for the individual test results.
解决方法:
这是因为测试代码时遇到错误,它会停止编译。只需要在pom.xml的<project>里添加以下配置,使得测试出错不影响项目的编译。
<build>
<plugins>
<plugin>
<groupId>org.apache.maven.plugins</groupId>
<artifactId>maven-surefire-plugin</artifactId>
<configuration>
<testFailureIgnore>true</testFailureIgnore>
</configuration>
</plugin>
</plugins>
</build>
异常3:
[ERROR] Failed to execute goal org.codehaus.cargo:cargo-maven2-plugin:1.0.6:start (start-Container) on project myproject: Execution start-container of goal org.codehaus.cargo:cargo-maven2-plugin:1.0.6:start failed: Error while expanding C:\DOCUME~1\ADMINI~1\LOCALS~1\Temp\cargo\installs\apache-tomcat-6.0.29.zip
[ERROR] Java.io.IOException: Negative seek offset
[ERROR] -> [Help 1]
[ERROR]
[ERROR] To see the full stack trace of the errors, re-run Maven with the -e swit
ch.
[ERROR] Re-run Maven using the -X switch to enable full debug logging.
[ERROR]
[ERROR] For more information about the errors and possible solutions, please rea
d the following articles:
[ERROR] [Help 1] http://cwiki.apache.org/confluence/display/MAVEN/PluginExecutio
nException
解决方法:
自己下载“apache-tomcat-6.0.29.zip”,将下载好的文件拷贝到指定文件夹“C:\Documents and Settings\Administrator\Local Settings\Temp\cargo\installs”下。
异常4:
[ERROR] Failed to execute goal org.apache.maven.plugins:maven-war-plugin:2.1.1:war (default-war) on project web_nanchang: Error assembling WAR: webxml attribute is required (or pre-existing WEB-INF/web.xml if executing in update mode) -> [Help 1]
[ERROR]
[ERROR] To see the full stack trace of the errors, re-run Maven with the -e switch.
[ERROR] Re-run Maven using the -X switch to enable full debug logging.
[ERROR]
[ERROR] For more information about the errors and possible solutions, please read the following articles:
解决方法:
maven的web项目默认的webroot是在src\main\webapp。如果在此目录下找不到web.xml就抛出以上的异常。解决方法在pom.xml加入以下的配置。红色字体改成你网站的根目录。
<build>
<finalName>simple-webapp</finalName>
<plugins>
<plugin>
<groupId>org.apache.maven.plugins</groupId>
<artifactId>maven-war-plugin</artifactId>
<version>2.1.1</version>
<configuration>
<webResources>
<resource>
<!-- this is relative to the pom.xml directory -->
<directory>WebContent</directory>
</resource>
</webResources>
</configuration>
</plugin>
</plugins>
</build>
maven的单元测试中没有的更多相关文章
- 使用Maven运行单元测试
要通过Maven运行单元测试,发出此命令: mvn test 这会在你的项目中运行整个单元测试. 案例学习 创建两个单元测试,并通过 Maven 的运行它.参见一个简单的 Java 测试类: pack ...
- maven 学习---使用Maven运行单元测试
要通过Maven运行单元测试,发出此命令: mvn test 这会在你的项目中运行整个单元测试. 案例学习 创建两个单元测试,并通过 Maven 的运行它.参见一个简单的 Java 测试类: pack ...
- 单元测试:单元测试中的mock
公司要求提升单元测试的质量,提高代码的分支覆盖率和行覆盖率,安排我研究单元测试,指定方案分享并在开发部普及开.整理完资料后,同步一下到博客. 单元测试中的mock的目的 mock的主要目的是让单元测试 ...
- ASP.NET 5 单元测试中使用依赖注入
相关博文:<ASP.NET 5 使用 TestServer 进行单元测试> 在上一篇博文中,主要说的是,使用 TestServer 对 ASP.NET 5 WebApi 进行单元测试,依赖 ...
- 单元测试中如何配置log4net
按道理来说,单元测试中基本没有对于日志的需求,这是由于单元测试的定位来决定的. 因为单元测试的思想就是针对的都是小段代码的测试,逻辑明确,如果测试运行不通过,简单调试一下,就能很容易地排查问题.但是单 ...
- 单元测试中使用Moq对EF的DbSet进行mock
刚用上Moq,就用它解决了一个IUnitOfWork的mock问题,在这篇博文中记录一下. 开发场景 Application服务层BlogCategoryService的实现代码如下: public ...
- Java Web学习系列——Maven Web项目中集成使用Spring、MyBatis实现对MySQL的数据访问
本篇内容还是建立在上一篇Java Web学习系列——Maven Web项目中集成使用Spring基础之上,对之前的Maven Web项目进行升级改造,实现对MySQL的数据访问. 添加依赖Jar包 这 ...
- 使用Ninject+Moq在单元测试中抽象数据访问层
一.测试方法的业务逻辑时,通常都需要从数据库读取测试数据,但是每次初始化数据库数据都很麻烦,也会影响到其它业务对数据的访问,怎样抽象数据访问层呢?就是用Moq去模拟数据访问的逻辑 二.步骤如下 ...
- 如何在单元测试中测试异步函数,block回调这种
大概有四种方法: runloop 阻塞主进程等待结果 semphaore 阻塞主进程等待结果 使用XCTestExpectation 阻塞主线程等待(我用这个,xcode自带的,为啥不用) 使用第三方 ...
随机推荐
- ceph压力测试结果总结
万兆网速的ceph分布式存储单虚拟机下的带宽和iops测试结果: 带宽: 写:700-850MB 读:800-900MB iops: 写:15000-20000 读:45000-55000
- 【转】@RequestBody注解出现的三点错误
错误1 { "timestamp": 1529747704259, "status": 415, "error": ...
- .net调用系统软键盘(兼容win7及win10)
没有什么技术说明,也是查询出来的,在此做记录 public class StartKeyBoard { public static bool isShowNumBoard = fa ...
- PythonStudy——字符串常用操作 String common operations
# 1.字符串的索引取值: 字符串[index]# 正向取值从0编号,反向取值从-1编号 s1 = '123abc呵呵' t_s = ' # 取出c print(s1[5], s1[-3]) # 2. ...
- windows openssh server 安装试用
使用Windows的可能会知道win10 的已经包好了openssh 服务,但是对于其他机器win 7 windows 2008 ,就需要其他的方法了 还好powershell 团队开发了支持wind ...
- Python3之max key参数学习记录
今天用Python写脚本,想要实现这样的功能:对于给定的字典,返回其中Value最大值对应的Key. 搜索后找到了解决方法,同时也学到了max key参数的作用. 例1, testlist = [9. ...
- 网络之 Iptables总结
查询iptables -L 默认 filter表iptables -L -t filteriptables -L -t natiptables -L -t mangle Filter表service ...
- vs2010安装的一些问题
VS安装出现的问题一般如果出现了 基本就不会安装成功.问题出现的原因有:w7系统的版本,有些可能会安装失败,其次就是你卸载的时候不要把相应 的库及.net的库卸载 后面再安装就容易出错.这个是安装 ...
- 防爆等级介绍 - IP65防爆等级和dIIBT4防爆等级的有什么区别?
IP65 IP是Ingress Protection的缩写,IP等级是针对电气设备外壳对异物侵入的防护等级,如:防爆电器,防水防尘电器,来源是国际电工委员会的标准IEC 60529,这个标准在2004 ...
- xterm下字体设置
code ~/.Xdefaults xterm*locale: true xterm.utf8: true xterm*utf8Title: true ! 滚动条 !XTerm*scrollBar: ...