mysql5.6.36 编译报错make[1]: *** [storage/perfschema/unittest/CMakeFiles/pfs_connect_attr-t.dir/all]..
cmake -DCMAKE_INSTALL_PREFIX=/usr/local/mysql -DMYSQL_DATADIR=/data/mysqldb -DMYSQL_UNIX_ADDR=/tmp/mysql.sock -DMYSQL_USER=mysql -DDEFAULT_CHARSET=utf8 -DDEFAULT_COLLATION=utf8_general_ci -DEXTRA_CHARSETS=gbk,gb2312,utf8,ascii -DENABLED_LOCAL_INFILE=ON -DWITH_INNOBASE_STORAGE_ENGINE=1 -DWITH_FEDERATED_STORAGE_ENGINE=1 -DWITH_BLACKHOLE_STORAGE_ENGINE=1 -DWITHOUT_EXAMPLE_STORAGE_ENGINE=1 -DWITH_FAST_MUTEXES=1 -DWITH_ZLIB=bundled -DENABLED_LOCAL_INFILE=1 -DWITHREADLINE=1 -DWITHEMBEDDED_SERVER=1 -DWITH_DEBUG=0 -DWITHOUT_PARTITION_STORAGE_ENGINE=1
编译信息如上,报错
make[2]: *** [storage/perfschema/unittest/pfs_connect_attr-t] 错误 1
make[1]: *** [storage/perfschema/unittest/CMakeFiles/pfs_connect_attr-t.dir/all] 错误 2
make: *** [all] 错误 2
解决方法
修改-DWITHOUT_PARTITION_STORAGE_ENGINE=0
重新编译安装
mysql5.6.36 编译报错make[1]: *** [storage/perfschema/unittest/CMakeFiles/pfs_connect_attr-t.dir/all]..的更多相关文章
- Mysql 5.6 编译报错
编译安装 mysql(下面是编译参数) /usr/local/bin/cmake . -DCMAKE_INSTALL_PREFIX=/application/mysql-5.6.36 \ -DMYSQ ...
- 使用C#模拟Outlook发送邮件,代码编译报错
添加OutLook API using OutLook = Microsoft.Office.Interop.Outlook; 发送邮件方法 public void SendEmail() { Out ...
- cordova编译报错:Execution failed for task ':processDebugResources'
cordova编译报错:Execution failed for task ':processDebugResources' 引发这个错误的最扩祸首就是一个中文命名的文件,不知道什么时候加入的,我写了 ...
- 编译报错dereferencing pointer to incomplete type
关于编译报错“dereferencing pointer to incomplete type... 多是没找到结构体的定义,可以在本地复制其定义试试. 参考: http://my.oschina.n ...
- Maven-010-maven 编译报错:Failure to ... in ... was cached in the local repository, resolution will not be reattempted until the update interval of nexus has elapsed or updates are forced.
今晚在编译 maven 项目的时候,命令行报错,出现 Failure to ... in ... 类似错误,详细的错误信息如下所示: [INFO] -------------------------- ...
- [Intellij] 编译报错 javacTask
报错信息: Idea 编译报错 javacTask: 源发行版 1.6 需要目标发行版 1.6 解决方案:
- jenkis编译报错:需要class,interface或enum
现象: 1.jenkis编译报错:需要class,interface或enum 2.使用ant进行编译ok. 解决方法: 1. Jenkis重新编译一个以前成功的svn版本,直至编译成功. 2.Jen ...
- 对arm指令集的疑惑,静态库运行,编译报错等问题
转载自http://www.jianshu.com/p/4a70aa03a4ea?utm_campaign=hugo&utm_medium=reader_share&utm_conte ...
- xocde7下导入libsqlite3.tbd编译报错的解决办法
在xocde7下没有libsqlite3.dylib,只有libsqlite3.tbd,然后我导入了tbd.编译报错error: /Applications/Xcode.app/Contents/De ...
随机推荐
- pandas处理json脱坑(一)--JsonError: Expecting property name enclosed in double quotes
python执行json.loads(…)时遇到的错误json格式的文本中应该用双引号,而不是单引号,如: brief=json.loads(row["brief"].replac ...
- Warning: (1260, 'Row xxx was cut by GROUP_CONCAT()')
MySql数据库查询时,使用group_concat报错“Row XXX was cut by GROUP_CONCAT()”,查了下是因为group_concat有个最大长度的限制,超过最大长度就会 ...
- [Luogu] 矩形覆盖
https://www.luogu.org/problemnew/show/P1034 数据太水 爆搜过掉 #include <iostream> #include <cstdio& ...
- 牛客练习赛55 E-树 树形DP
题意 你有一颗大小为\(n\)的树,点从\(1\)到\(n\)标号. 设\(dis(x,y)\)表示\(x\)到\(y\)的距离. 求\(\sum_{i=1}^{n}\sum_{j=1}^{n}di ...
- VC/DDK/DriverWorks开发环境配置
1·前言开发windows内核驱动程序是一个非常具有挑战性的工作,你得忍耐调试过程中操作系统 不断蓝屏.不断崩溃的噩梦,所以强烈建议你采用虚拟机做开发平台,这样即使把整个系统都搞蹦了,大不了从新装过虚 ...
- k8s/Kubernetes常用组件Helm的部署
Helm的安装 1.Helm的基本概念 Helm是Kubernetes的一个包管理工具,用来简化Kubernetes应用的部署和管理.可以把Helm比作CentOS的yum工具. Helm有如下几个基 ...
- 1628:X-factor Chain
1628:X-factor Chain 时间限制: 1000 ms 内存限制: 524288 KB提交数: 122 通过数: 68 [题目描述] 原题来自 POJ 3421 输 ...
- JVM——类加载
一.什么是类加载? JVM将class字节码文件加载到内存中, 并将这些静态数据转换成方法区中的运行时数据结构,在堆中生成一个代表这个类的java.lang.Class 对象,作为方法区类数据的访问入 ...
- Contest Hunter 3101
题目 Contest Hunter 3101 阶乘分解 原题传送门 题目分析 这里介绍一个本蒟蒻自己\(yy\)出来的方法. 我们发现,对于某一个单个的整数\(n\),若\(n\)能被某一个数\(x\ ...
- 【C/C++】Linux的gcc和g++的区别
Windows中我们常用vs来编译编写好的C和C++代码:vs把编辑器,编译器和调试器等工具都集成在这一款工具中,在Linux下我们能用什么工具来编译所编写好的代码呢,其实Linux下这样的工具有很多 ...