java.util.NoSuchElementException错误原因及解决方案
1.原因:没有控制语句导致的迭代器的越界,使得map中的数据无法传入reduce,从而无法把结果传入目标文件中。
在进行Mapreduce实例——WordCount实验时遇到的错误,开始以为是lib包导入和读取源文件格式的问题,后来无论怎么修改都会报这个错误,报错如下:
java.lang.Exception: java.util.NoSuchElementException
at org.apache.hadoop.mapred.LocalJobRunner$Job.runTasks(LocalJobRunner.java:491)
at org.apache.hadoop.mapred.LocalJobRunner$Job.run(LocalJobRunner.java:551)
Caused by: java.util.NoSuchElementException
at java.util.StringTokenizer.nextToken(StringTokenizer.java:349)
at mapreduce.WordCount$doMapper.map(WordCount.java:43)
at mapreduce.WordCount$doMapper.map(WordCount.java:1)
at org.apache.hadoop.mapreduce.Mapper.run(Mapper.java:146)
at org.apache.hadoop.mapred.MapTask.runNewMapper(MapTask.java:793)
at org.apache.hadoop.mapred.MapTask.run(MapTask.java:341)
at org.apache.hadoop.mapred.LocalJobRunner$Job$MapTaskRunnable.run(LocalJobRunner.java:270)
at java.util.concurrent.Executors$RunnableAdapter.call(Executors.java:473)
at java.util.concurrent.FutureTask.run(FutureTask.java:262)
at java.util.concurrent.ThreadPoolExecutor.runWorker(ThreadPoolExecutor.java:1152)
at java.util.concurrent.ThreadPoolExecutor$Worker.run(ThreadPoolExecutor.java:622)
at java.lang.Thread.run(Thread.java:748)
18/11/16 00:25:39 INFO mapreduce.Job: Job job_local1205845239_0001 failed with state FAILED due to: NA
18/11/16 00:25:39 INFO mapreduce.Job: Counters: 0
错误根源:

2.解决方案:
解决方案1
if(tokenizer.hasMoreTokens())
{
this.word.set(tokenizer.nextToken());
context.write(this.word, one);
}
解决方案2
if(!value.toString().equals(""))
{
word.set(tokenizer.nextToken());
context.write(word, one);
}
java.util.NoSuchElementException错误原因及解决方案的更多相关文章
- Android 关于java.util.NoSuchElementException错误
写了一个从A文件复制到B文件的例子,其中要求去掉重复的行. 于是想到了Set,这本来是很容易的事情,结果在向外写数据时抱错 Java.util.NoSuchElementException 网络上反复 ...
- maven项目新检出后不编译爬坑记 及 mvn clean package报错 WagonTransporterFactory: java.util.NoSuchElementException 异常【我】
从SVN新检出一个maven项目,配置好后,发现项目无法编译(只有一个test包中的代码显示编译报错,其他所有包中的代码都不编译,也不报错), 先注释掉报错的test包中的所有内容, 用Eclipse ...
- java.util.NoSuchElementException: No value present
错误: java.util.NoSuchElementException: No value present 原因: 经查询博客Java 8 Optional类深度解析发现,究其原因为: 在空的Opt ...
- Java学习笔记之Scanner报错java.util.NoSuchElementException
转载自:IT学习者-螃蟹 一个方法A使用了Scanner,在里面把它关闭了.然后又在方法B里调用方法A之后就不能再用Scanner了Scanner in = new Scanner(System.in ...
- 遍历List过程中删除操作报java.util.ConcurrentModificationException错误
1:遍历List 同时 remove 元素,出现java.util.ConcurrentModificationException错误 @Test public void test3(){ List& ...
- 【spring data jpa】启动报错:nested exception is java.util.NoSuchElementException
spring boot项目中 使用spring data jpa 启动报错: org.springframework.beans.factory.UnsatisfiedDependencyExcept ...
- Java标准输入流system.in报错: java.util.NoSuchElementException解决方法
我的程序大概是这样的: main()主函数里面,调用两个自定义的方法,这里我们称之为方法a和方法b: 主函数main()里有一个:Scanner scanner = new Scanner(Syste ...
- java.util.NoSuchElementException
问题引入 Java商店作业不同函数里需要获取用户输入,用Scanner的时候,出现了异常java.util.NoSuchElementException 作业中代码模式如下,func1和func2中都 ...
- 解决:Redis:java.util.NoSuchElementException: Unable to validate object at
在Java使用Redis的过程中遇见了一个问题, redis.clients.jedis.exceptions.JedisConnectionException: Could not get a re ...
随机推荐
- 谷歌浏览器的各个版本对应的webdriver(chromedrive)-超级详细
简介 近来看到各个测试群里的小伙伴由于安装的谷歌浏览器版本各不相同,有高有低,这可是难住愁坏了一大批人,所以都在要各种版本的谷歌浏览器相对应的chromedrive,为此找了一个淘宝镜像网址供大家下载 ...
- 【重学计算机】机组D6章:中央处理器
1. CPU的组成与功能 2. 数据通路 概念:执行部件间传送信息的路径,分共享通路(总线)和专用通路 抽象模型:时钟驱动下,A --> 组合逻辑 --> B D触发器定时模型: 时钟触发 ...
- 【Android Studio安装部署系列】七、真机运行项目
版权声明:本文为HaiyuKing原创文章,转载请注明出处! 概述 简单介绍下真机运行项目的操作步骤. 手机连接电脑 将手机通过数据线连接到电脑上,此时电脑会自动下载安装驱动程序.如果没有安装上的话, ...
- 用SpringCloud进行微服务架构演进
在<架构师必须要知道的阿里的中台战略与微服务> 中已经阐明选择SpringCloud进行微服务架构实现中台战略,因此下面介绍SpringCloud的一些内容,SpringCloud已经出来 ...
- Asp.Net Core 轻松学-利用文件监视进行快速测试开发
前言 在进行 Asp.Net Core 应用程序开发过程中,通常的做法是先把业务代码开发完成,然后建立单元测试,最后进入本地系统集成测试:在这个过程中,程序员的大部分时间几乎都花费在开发.运行 ...
- 如何在linux下使用git管理上传代码&误删文件修复
首先需要安装git,sudo apt-get install git,这时就可以下载代码了. 然后先在gituhub上新建一个仓库,然后先在本地建一个git目录,git init 然后再配置用户名和邮 ...
- Springboot 系列(七)Spring Boot web 开发之异常错误处理机制剖析
前言 相信大家在刚开始体验 Springboot 的时候一定会经常碰到这个页面,也就是访问一个不存在的页面的默认返回页面. 如果是其他客户端请求,如接口测试工具,会默认返回JSON数据. { &quo ...
- H5 可堆叠的圆环进度条,支持任意数量子进度条
by Conmajia SN: S22-W1M 由来 看到一篇帖子<vue实用组件--圆环百分比进度条>,让我想起了很多年前我在WinForm下仿制过的Chrome进度条. ▲ 原版进度条 ...
- 【1】Asp.Net Core2.2从环境配置到应用建立
作者:Eleven 来源:公众号[软谋net] [前言] .Net Core开源&跨平台,已经肉眼可见将成为.Net平台的未来,在企业招聘需求上已经频频见到,接触到很多公司内部都已经开始尝试C ...
- js + 加号 报错,IIS 配置
一.问题描述: 1开发环境完全没有问题: 2 build 后生成的js脚本,带有+号. 程序发布到IIS后,带加+号js脚本报错. 二.解决方案 1 修改build规则,让它不产生特殊符号. 能力有 ...