Boost test vs2013 fatal error C1001
Boost test vs2013 fatal error C1001
Boost test库提供了一个用于单元测试的基于命令行界面的测试套件UTF:Unit Test Framework,具有单元测试、检测内存泄露、监控程序运行的功能。根据官网介绍boost支持很多编译器。然而在Visual Studio 2013中使用boost的test模块时会报致命错误,如下图所示:

输出报错信息如下:
1>------ Build started: Project: Test, Configuration: Debug Win32 ------
1> main.cpp
1>d:\boost_1_70_0\boost\type_traits\common_type.hpp(47): fatal error C1001: An internal error has occurred in the compiler.
1> (compiler file 'msc1.cpp', line 1325)
1> To work around this problem, try simplifying or changing the program near the locations listed above.
1> Please choose the Technical Support command on the Visual C++
1> Help menu, or open the Technical Support help file for more information
========== Build: 0 succeeded, 1 failed, 0 up-to-date, 0 skipped ==========

定位到报错文件是common_type.hpp:

可以看出是因为CXX11的原因,因为VS2013不支持C++11,要么升级VS2013,打上支持CXX11的补丁,要么使用如下方法:
所以boost提供了一个宏定义来设置是否支持CXX11:
BOOST_NO_CXX11_TEMPLATE_ALIASES
在Project->Properties->C/C++->Preprocessor中设置即可:

在Visual Studio 2013中使用boost的test模块时会报致命错误,是因为VS2013没有完全支持CXX11标准。通过一个宏定义可以在不支持CXX11标准的编译器上继续使用boost.
Boost test vs2013 fatal error C1001的更多相关文章
- 【VS开发】fatal error C1001:编译器中发生内部错误
自己编译boost的库文件时遇到这个错误的,大概报错情况如下: mp_defer.hpp<50>:fatal error C1001:编译器中发生内部错误. 1> 要解决此问题, ...
- fatal error c1001 编译器中发生内部错误 OpenMesh6.3
Internal Compiler Error VS 2015 Update1 VS2015 Update1 编译OpenMesh的额代码时发生错误 fatal error c1001 编译器中发生内 ...
- 解决 Boost安装:fatal error: bzlib.h: No such file or directory 问题
参考: How to install all the boost development libraries? 解决 Boost安装:fatal error: bzlib.h: No such fil ...
- 编译boost程序出现如下错误fatal error LNK1104: cannot open file 'libboost_system-vc100-mt-gd-1_54.lib'的解决方法
对于如下程序: #include <iostream> #include <boost/asio.hpp> #include <boost/date_time/posix ...
- vs2013问题解决办法—>fatal error LNK1168 如何避免
问题:在使用visial studio 2013运行成功程序,但当修改其中的一段后,即语法,执行后报错 出现error:fatal error LNK1168:无法打开……\xxx.exe进行写入. ...
- 解决“LINK : fatal error LNK1123: 转换到 COFF 期间失败: 文件无效或损坏”问题
更新VS2010,或者卸载VS2013安装2010后,建立项目时会出现"LINK : fatal error LNK1123: 转换到 COFF 期间失败: 文件无效或损坏"的错误 ...
- cc1plus: fatal error: emeralddb-pmdMain.d: No such file or directory
签名autoscan, aclocal, config啥的都没错,最后make 报下面的错,查了各个文件没发现有啥问题,请哪位帮忙卡看 make[1]: Entering directory `/ro ...
- fatal error C1083: 无法打开包括文件: “SDKDDKVer.h”: No such file or directory(转)
fatal error C1083: 无法打开包括文件: “SDKDDKVer.h”: No such file or directory 解决办法:(Vs2013中) 项目--右键--属性--配置属 ...
- LINK : fatal error LNK1104
今天本来想试试opencv的,于是就在自己的机子上部署一下试试,结果一直遇到这个错误:LINK : fatal error LNK1104 环境:win7 64位 vs2012 opencv 2.4. ...
随机推荐
- QT中QString与string的转化,解决中文乱码问题
在QT中,使用QString输出到控件进行显示时,经常会出现中文乱码,网上查了一圈,发现大部分都是针对QT4增加4条语句:</span> [cpp] view plain copy QTe ...
- (转)C# 使用UDP组播实现局域网桌面共享
转:http://www.cnblogs.com/mobwiz/p/3715743.html 最近需要在产品中加入桌面共享的功能,暂时不用实现远程控制:参考了园子里的一些文章,加入了一些自己的修改. ...
- 二分查找总结及部分Lintcode题目分析 2
Search in a big sorted array,这个比之前的二分法模板多了一个很不同的特性,就是无法知道一个重要的条件end值,也是题目中强调的重点 The array is so big ...
- iOS开发线程之NSThread
1.初始化 - (instancetype)init API_AVAILABLE(macos(10.5), ios(2.0), watchos(2.0), tvos(9.0)) NS_DESIGNAT ...
- Celery - 异步任务 , 定时任务 , 周期任务
1.什么是Celery?Celery 是芹菜Celery 是基于Python实现的模块, 用于执行异步定时周期任务的其结构的组成是由 1.用户任务 app 2.管道 broker 用于存储 ...
- Jumpserver-1.5.2 安装步骤
Jumpsever 是飞致云旗下的一块开源的堡垒机.在如今都在上云的趋势下,一款堡垒机非常重要. 官网:http://jumpserver.org/ GitHub:https://github.com ...
- 2018-8-10-win10-uwp-如何判断一个对象被移除
title author date CreateTime categories win10 uwp 如何判断一个对象被移除 lindexi 2018-08-10 19:16:50 +0800 2018 ...
- (一)phonegap自学---不会java也会写原生app
移动设备如日中天的今天 微软的表现让我们这些.net程序员无不心寒!!幸好每次乱世出英豪,古有java能夸平台,.net跨语言,今有phonegap跨设备 phonegap是什么 狂点这 http:/ ...
- 看 《android权威编程指南》 的笔记
Android 编译工具 确保ant已安装并正常运行,android sdk的tools/和platform-tools目录包含在可执行文件的搜索路径中 切换到项目目录并执行以下命令: android ...
- 倍增(在线)求LCA
这几天,提高B组总是有求LCA的题.由于我是蒟蒻,所以老是做不出来,直接上暴力.现在才弄懂. 没耐心看前面部分的大神门可以直接看后面. ST(RMQ)算法(在线)求LCA LCA是什么? 在一棵树上, ...