从码云上下载vue项目,运行npm run dev 时报错:

> webpack-dev-server --inline --progress --config build/webpack.dev.conf.js

'webpack-dev-server' 不是内部或外部命令,也不是可运行的程序
或批处理文件。
npm ERR! code ELIFECYCLE
npm ERR! errno 1
npm ERR! vue@1.0.0 dev: `webpack-dev-server --inline --progress --config build/webpack.dev.conf.js`
npm ERR! Exit status 1
npm ERR!

等等.........

解决办法:先看拉下来的代码是否有  "node_modules"这个文件夹,如果有的话删除,在依次执行npm install和npm run build,和npm run dev命令,然后就应该可以运行起来啦。

Vue 项目: npm run dev 报错 webpack-dev-server的更多相关文章

  1. vue项目npm run dev 报错error in ./src/main.js Module build failed: Error: Cannot find module 'babel-plugin-syntax-jsx'

    问题: vue 项目npm run dev运行时报错,如下图:  原因: 缺少相应的组件 解决办法: 安装相应组件: npm install babel-plugin-syntax-jsx --sav ...

  2. vue项目npm run dev 报错error in ./src/main.js Module build failed: ReferenceError: Unknown plugin "transform-vue-jsx" specified in......

    问题: vue项目npm run dev运行时报错,如下图:  原因: 缺少组件 解决办法: 安装相应的组件:  npm install babel-plugin-transform-vue-jsx ...

  3. create-react-app创建项目后,运行npm run eject报错解决方法

    运行npm run eject报错解决方法 主要问题是脚手架添加.gitgnore文件,但是却没有本地仓库,使用以下命令操作以下就可以了 git init git add . git commit - ...

  4. vue-electron 使用sqlite3数据库,执行npm run build 报错 .NET Framework 2.0 SDK,Microsoft Visual Studio 2005[C:\temp\wechat\node_modules\sqlite3\build\binding.sln]

    问题描述 vue-electron 使用sqlite3数据库,执行npm run build 报错如下: .NET Framework 2.0 SDK,Microsoft Visual Studio ...

  5. vue中执行npm run build报错解决方法?

    遇到了执行npm run build 后报错: [build:js ] Module not found: Error: Can't resolve 'scss-loader' in 'D:\work ...

  6. vue项目npm run dev 报错Uncaught SyntaxError: Unexpected token <

    目前代码所处位置是micro分支,该分支是从dev分支直接拉下来进行npm run dev的,而dev分支是可以正常运行的,网上的诸多解释是babel转义时候报错,其实对比可见,两个分支不同的地方应该 ...

  7. vue项目npm run dev报错events.js:160 throw er; // Unhandled 'error' event listen EADDRINUSE :::8002

    出错情况,如下图: 报错原因: listen EADDRINUSE :::8002 意思是当前8002端口被占用 解决办法: 一:简单粗暴:关掉可能影响的相关程序,重新执行启动. 二: 1.Win+R ...

  8. VUE项目 npm run build卡住不动,也不报错

    npm config set registry http://registry.cnpmjs.org try again npm run build 居然能动了....

  9. create-react-app 构建的项目使用释放配置文件 webpack 等等 运行 npm run eject 报错

    使用 git 提交一次记录即可正常 git add . git commit -m 'init' npm run eject

  10. 转载:TypeError: Cannot read property 'compilation' of undefined vue 打包运行npm run build 报错

    转载自:https://www.jianshu.com/p/3f8f60e01797 运行npm run build打包时,报错如下:   我的package.json如下: { ... " ...

随机推荐

  1. 论文笔记:Mask R-CNN

    之前在一次组会上,师弟诉苦说他用 UNet 处理一个病灶分割的任务,但效果极差,我看了他的数据后发现,那些病灶区域比起整张图而言非常的小,而 UNet 采用的损失函数通常是逐像素的分类损失,如此一来, ...

  2. c#串口编程(转)

    在单片机项目开发中,上位机也是一个很重要的部分,主要用于数据显示(波形.温度等).用户控制(LED,继电器等),下位机(单片机)与 上位机之间要进行数据通信的两种方式都是基于串口的: USB转串口 — ...

  3. HDMI热插拔检测原理

    HDMI(19Pin)/DVI(16 pin)的功能是热插拔检测(HPD),这个信号将作为主机系统是否对HDMI/DVI是否发送TMDS信号的依据.HPD是从显示器输出送往计算机主机的一个检测信号.热 ...

  4. org/eclipse/jetty/server/Handler : Unsupported major.minor version 52.0

    注:本文来源于<org/eclipse/jetty/server/Handler : Unsupported major.minor version 52.0> Exception in ...

  5. CISPA Scyther tools

    1.Scyther软件作者网站的整理 Scyther工具的网站主页:https://people.cispa.io/cas.cremers/index.html 首先 对Scyther软件的资料进行整 ...

  6. trie字典树:初学

    应用: 1.前缀问题 2.异或问题(转化为前缀问题) 3.查询问题 思想: 将要进行匹配的字符串化为一颗树 字符为边,在结束位置统计该串的全部信息 操作:插入,查询,删除.etc ac: #inclu ...

  7. SSL 3.0曝出Poodle漏洞的解决方案

    tomcat 各版本对ssl解决方案的配置:tomcat6: <Connector port="443" protocol="org.apache.coyote.h ...

  8. 关于JS前台计算四舍五入的问题

    //除法函数 //说明:javascript的除法结果会有误差,在两个浮点数相除的时候会比较明显.这个函数返回较为精确的除法结果. //调用:accDiv(arg1,arg2) //返回值:arg1除 ...

  9. kubernets HA集群手动部署

    来源:  https://www.cnblogs.com/yangxiaoyi/p/7606121.html  http://blog.51cto.com/newfly/2288088?source= ...

  10. 8、socket以及socketserver

    Python 提供了两个基本的 socket 模块.第一个是 Socket,它提供了标准的 BSD Sockets API.第二个是 SocketServer, 它提供了服务器中心类,可以简化网络服务 ...