在Ubuntu 16.04.5 LTS编译android 5.1报错

[19:17:13.062]libnativehelper/JniInvocation.cpp:165: error: unsupported reloc 43
[19:17:13.062]libnativehelper/JniInvocation.cpp:165: error: unsupported reloc 43
[19:17:13.062]libnativehelper/JniInvocation.cpp:165: error: unsupported reloc 43
[19:17:13.062]libnativehelper/JniInvocation.cpp:165: error: unsupported reloc 43
[19:17:13.063]clang: error: linker command failed with exit code 1 (use -v to see invocation)
[19:17:13.063]build/core/host_shared_library_internal.mk:44: recipe for target 'out/host/linux-x86/obj32/lib/libnativehelper.so' failed
[19:17:13.063]make: *** [out/host/linux-x86/obj32/lib/libnativehelper.so] Error 1
[19:17:13.063]
[19:17:13.063]#### make failed to build some targets (6 seconds) ####

参考

https://blog.csdn.net/u014770862/article/details/52624851

cp /usr/bin/ld.gold   prebuilts/gcc/linux-x86/host/x86_64-linux-glibc2.11-4.6/x86_64-linux/bin/ld 

修改后重新make ok

error: unsupported reloc 43的更多相关文章

  1. Ubuntu16 编译源码出错 unsupported reloc 43

    错误如下 prebuilts/gcc/linux-x86/host/x86_64-linux-glibc2.11-4.6//x86_64-linux/include/c++/4.6/bits/basi ...

  2. 使用GBK编码请求访问nodejs程序报415错误:Error: unsupported charset at urlencodedParser ...

    最近遇到一个问题,第三方用户向我们提供给的回调地址发送请求时一直报415错误,结果发现他们使用的是GBK编码请求,而我们使用的node + express4 程序,不支持GBK编码请求. 问题出在下面 ...

  3. 安装 R 包报错 clang: error: unsupported option '-fopenmp' 的解决方法

    MacOS 上安装 R 包 install.packages("data.table") 后面提示是否安装需要编译的版本: Do you want to install from ...

  4. Python locale error: unsupported locale setting

    pip don't install package. Python locale error: unsupported locale setting .. >>> import lo ...

  5. [问题解决]Python locale error: unsupported locale setting

    原文来源:https://stackoverflow.com/questions/14547631/python-locale-error-unsupported-locale-setting 安装f ...

  6. Android Studio导入项目,报错 Error:Unsupported method: BaseConfig.getApplicationIdSuffix().

    从GitHub上clone下来的第三方库,由于时间间隔很长,gradle的版本和本机的版本不一致,导入到Android Studio中会报错,错误信息如下: Error:Unsupported met ...

  7. {"timestamp":"2019-11-12T02:39:28.949+0000","status":415,"error":"Unsupported Media Type","message":"Content type 'text/plain;charset=UTF-8' not supported","path":&quo

    在Jmeter运行http请求时报错: {"timestamp":"2019-11-12T02:39:28.949+0000","status&quo ...

  8. Error:unsupported class file version 52.0问题的解决

    这个问题主要的原因是依赖包的编译版本比主程序的编译版本高,导致主程序无法正常编译或运行,解决这个问题无非两招: 1.提升主程序的编译器版本,用最新的编译器编译主程序,这样就可以兼容那个依赖包 2.降低 ...

  9. CentOS 7提示:ERROR unsupported format character '(0xffffffe7) at/域安装失败,您可以运行下列命令重启您的域:

    别理会,直接装即可,这个错误不影响使用.

随机推荐

  1. File Inclusion(文件包含)

    File Inclusion,意思是文件包含(漏洞),是指当服务器开启allow_url_include选项时,就可以通过php的某些特性函数(include(),require()和include_ ...

  2. open failed: EACCES (Permission denied)

    出现背景:调用系统相册进行图片展示,但是没有成功,是空白的,且检查权限无问题 解决方法

  3. PHP中的PDO操作学习(三)预处理类及绑定数据

    要说 PDO 中最强大的功能,除了为不同的数据库提供了统一的接口之外,更重要的就是它的预处理能力,也就是 PDOStatement 所提供的功能.因为它的存在,才让我们可以安心地去使用而不用操心 SQ ...

  4. Linux系列(16) - 其他帮助命令

    总结 如何判断一个命令是不是shell内部自带命令 使用命令whereis,whereis可以用来判断一个命令是否是shell内部命令: ls在/bin/下面有可执行文件,说明ls命令不是shell内 ...

  5. ubuntu中如何切换普通用户、root用户

    1.打开Ubuntu,输入命令:su root,回车提示输入密码,输入密码后提示:认证失败. 2.给root用户设置密码: 命令:sudo passwd root 输入密码,并确认密码. 3.重新输入 ...

  6. HTML 网页开发、CSS 基础语法——十二.CSS选择器

    选择器 基础选择器:标签选择器,id选择器,类选择器,通配符选择器 高级选择器:后代选择器,交集选择器,并集选择器 1. 标签选择器: • 优点:可以选中所有的同名标签,设置所有同名标签的公共样式. ...

  7. java多线程--启动线程

    简单理解启动线程的几种方式: 1. 实现Runnable接口创建一个任务, 调用myTask.run()方法来启动它 2, 构建Thread对象, 调用thread.start()方法启动 这里可以看 ...

  8. SpringBoot 如何进行限流?老鸟们都这么玩的!

    大家好,我是飘渺.SpringBoot老鸟系列的文章已经写了四篇,每篇的阅读反响都还不错,那今天继续给大家带来老鸟系列的第五篇,来聊聊在SpringBoot项目中如何对接口进行限流,有哪些常见的限流算 ...

  9. PHP审计之POP链挖掘

    PHP审计之POP链挖掘 前言 续上文中的php反序列化,继续来看,这个POP的挖掘思路.在其中一直构思基于AST去自动化挖掘POP链,迫于开发能力有限.没有进展,随后找到了一个别的师傅已经实现好的项 ...

  10. vue3 专用 indexedDB 封装库,基于Promise告别回调地狱

    IndexedDB 的官网 https://developer.mozilla.org/zh-CN/docs/Web/API/IndexedDB_API 这个大概是官网吧,原始是英文的,现在陆续是出中 ...