Download the Apache maven from this link https://maven.apache.org/download.cgi, extract the download archive, can also use the command.

cd ~/Downloads
wget http://apache.mirrors.timporter.net/maven/maven-3/3.1.1/binaries/apache-maven-3.1.1-bin.tar.gz sudo mkdir -p /usr/local/apache-maven
sudo mv apache-maven-3.1.1-bin.tar.gz /usr/local/apache-maven
cd /usr/local/apache-maven
sudo tar -xzvf apache-maven-3.1.1-bin.tar.gz

Edit ~/.profile with

gedit ~/.profile

and add these four lines:

export M2_HOME=/usr/local/apache-maven/apache-maven-3.1.1
export M2=$M2_HOME/bin
export MAVEN_OPTS="-Xms256m -Xmx512m"
export PATH=$M2:$PATH

Install Apache Maven on Ubuntu的更多相关文章

  1. Download and Install Apache Zookeeper on Ubuntu

    http://www.techburps.com/misc/download-and-install-apache-zookeepr/36 In previous article of this Bi ...

  2. How To Install Apache Kafka on Ubuntu 14.04

    打算学习kafka ,接触一些新的知识.加油!!! 参考:https://www.digitalocean.com/community/tutorials/how-to-install-apache- ...

  3. mavne install 报错org.apache.maven.surefire.util.SurefireReflectionException: java.lang.reflect.InvocationTargetException

    maven install 报错 org.apache.maven.surefire.util.SurefireReflectionException: java.lang.reflect.Invoc ...

  4. Maven进行install的时候报错,COMPILATION ERROR : Failed to execute goal org.apache.maven.plugins:maven-surefire-plugin:2.13:test (default-test) on project cmu: There are test failures.

    maven进行install的时候,test类里面报错: COMPILATION ERROR : [INFO] -------------------------------------------- ...

  5. Maven install 报错: Failed to execute goalorg.apache.maven.plugins:maven-gpg-plugin:1.4:sign (sign-art

    执行 Maven install 时报错: Failed to execute goalorg.apache.maven.plugins:maven-gpg-plugin:1.4:sign (sign ...

  6. 解决maven install报错信息(Failed to execute goal org.apache.maven.plugins:maven-compiler-plugin:3.1:compile )

    Maven install失败 Failed to execute goal org.apache.maven.plugins:maven-compiler-plugin:3.1:compile (d ...

  7. maven install时报错 Failed to execute goal org.apache.maven.plugins:maven-surefire-plugin:2.12.4:test (default-test)

    今天在一个maven项目上执行maven install命令的时候一直报错,错误信息如下: [INFO] ----------------------------------------------- ...

  8. Ubuntu系统Apache Maven安装

    操作系统:Linux x64 / Ubuntu 14.04 Apache Maven版本:3.3.9 建议预先搭建Java开发环境:详见上一篇<Linux Ubuntu系统下Java开发环境搭建 ...

  9. mvn install 报错Failed to execute goal org.apache.maven.plugins:maven-compiler-plugin:2.3.2 错误: 找不到符号

    报错信息 在Eclipse中执行mvn install时,console端显示如下报错信息: [ERROR] Failed to execute goal org.apache.maven.plugi ...

随机推荐

  1. Ecshop表结构 order_info

    CREATE TABLE IF NOT EXISTS `ecs_order_info` (  `order_id` mediumint(8) unsigned NOT NULL AUTO_INCREM ...

  2. Browsersync结合gulp和nodemon实现express全栈自动刷新

    Browsersync能让浏览器实时.快速响应你的文件更改(html.js.css.sass.less等)并自动刷新页面.更重要的是 Browsersync可以同时在PC.平板.手机等设备下进项调试. ...

  3. Message对象

    一)描述 1: 每一个Message对象都包含两个对象: (1)google::protobuf::Descriptor 描述对象,是Message所有Filed的一个集合,它又包含了FieldDes ...

  4. django 定义文章url

    url(r'^firstcontent/'+str(date)+'/(?P<first_body_id>\d+)/$', views.firstcontent, name='firstco ...

  5. 如何删除Sitecore CMS中的项目

    在此“如何”帖子中,我将介绍如何删除项目以及如何在Sitecore CMS中恢复已删除的项目. 删除项目 有多种方便的方法可以删除Sitecore中的项目. 从功能区 在内容树中选择您要删除的项目. ...

  6. FILE文件删除操作(删除指定文件夹下所有文件和文件夹包括子文件夹下所有文件和文件夹),就是删除所有

    2018-11-05  19:42:08开始写 选择 删除 1.FileUtils.java类 import java.io.File;//导入包 import java.util.List;//导入 ...

  7. 【转】推荐4个不错的Python自动化测试框架

    之前,开发团队接手一个项目并开始开发时,除了项目模块的实际开发之外,他们不得不为这个项目构建一个自动化测试框架.一个测试框架应该具有最佳的测试用例.假设(assumptions).脚本和技术来运行每一 ...

  8. 从零开始学习MVC

    其实在学校时,已经开设了MVC这门课程,教材由授课老师自己编纂,是和微软的音乐商店相似的一个书店项目,当时无法理解 Linq.Lambda , 只记得是按照老师的方法,复制+粘贴,不明其意,亦不知其理 ...

  9. python操作Mysql数据库示例

    python库:pymysql 安装:install pymysql.mysql数据库 一.连接数据库.创建speder库.查询版本. import pymysql ##链接数据库 db = pymy ...

  10. python SQLite说一点点, python使用数据库需要注意的几点

    SQLite是一种嵌入式数据库,它的数据库就是一个文件.由于SQLite本身是C写的,而且体积很小,所以,经常被集成到各种应用程序中,甚至在iOS和Android的App中都可以集成. Python就 ...