学习笔记

compileDebugJavaWithJavac,缺少插件,在module app gradle文件最上面添加一段 apply plugin: 'me.tatarka.retrolambda'(插件根据需要添加,此处为支持lambda表达式的插件)
添加好以后还得在priject app gradle文件最上面添加一段 apply plugin: 'com.github.dcendents.android-maven'然后后ok了。

compileDebugJavaWithJavac的更多相关文章

  1. Build fails with an error: Execution failed for task ':react-native-google-analytics-bridge:compileDebugJavaWithJavac'.

    1,问题 Build fails with an error: Execution failed for task ':react-native-google-analytics-bridge:com ...

  2. :app:compileDebugJavaWithJavac

    org.gradle.initialization.ReportedException: org.gradle.internal.exceptions.LocationAwareException: ...

  3. Android Error:Execution failed for task ':app:compileDebugJavaWithJavac' 解决方案

    今天使用 Android Studio 构建项目的时候出现了这个错误 compileDebugJavaWithJavac 通过搜索发现造成该问题的原因有很多需要结合具体的项目进行排查 通过 Andro ...

  4. android排除报很多错方法 Execution failed for task ':app:compileDebugJavaWithJavac' in Android Studio

    android排除报很多错方法1.回撤对应layout的xml改动2.回撤对应java的改动3.重命名文件后导致的资源不对应 Execution failed for task ':app:compi ...

  5. Android Studio Error:Execution failed for task ':app:compileDebugJavaWithJavac' 根本解决方法

    造成这种异常的原因有很多.具体的还是要去终端编译,查看到底是什么地方出错了,然后具体问题具体分析. 终端进入项目的根目录,然后输入命令 gradlew compileDebugJavaWithJava ...

  6. Error:Execution failed for task ':app:compileDebugJavaWithJavac'

    百度一下呗 查找了各种解决方案,都不对症. 最后发现,造成这种异常的原因有很多.具体的还是要去终端编译,查看到底是什么地方出错了,然后具体问题具体分析. 终端进入项目的根目录,然后输入命令 ./gra ...

  7. android编译时出现org.gradle.api.tasks.TaskExecutionException: Execution failed for task ':app:compileDebugJavaWithJavac'.错误

    android studio中使用terminal工具.在android studio最下面的底部菜单栏中有(如果没有那cmd中进入项目根目录后): 使用命令  gradlew compileDebu ...

  8. 异常:Error:Execution failed for task ':app:compileDebugJavaWithJavac'. > Compilation failed; see the compiler error output for details.

    碰到这个异常我也是挺无语的,因为Android Studio根本不会提示你详细的错误信息. 我们来看看这个博主:http://blog.csdn.net/runner__1/article/detai ...

  9. [Android]Android端ORM框架——RapidORM(v2.0)

    以下内容为原创,欢迎转载,转载请注明 来自天天博客:http://www.cnblogs.com/tiantianbyconan/p/5626716.html [Android]Android端ORM ...

随机推荐

  1. unity开发相关环境(vs、MonoDevelop)windows平台编码问题

    情景描述:最近在做Unity的网络底层,用VS编写源码,MonoDevelop用来Debug,在Flash Builder上搭建的Python做协议生成器,期间有无数次Unity莫名奇妙的的down掉 ...

  2. 自制编程语言crowbar(v0.1)构建解析器时分配内存

    crowbar中第一次申请内存是在生成解析器的时候: /* interface.c */CRB_Interpreter *CRB_create_interpreter(void) { MEM_Stor ...

  3. ScrollView中嵌套GridView,ListView只显示一行的解决办法

    转载:http://blog.csdn.net/luohai859/article/details/39347583 关于为什么只显示一行,个人理解是:如果单独使用GridView和ListView, ...

  4. 手机软件Toast无法显示提示信息

    近日在做项目时,测试组的同事提出一个bug,就是在一台LG手机上,原本应该显示的Toast信息,都不显示,消息栏也没有出现通知,后来经过查资料知道有些三星.LG手机默认禁用了显示通知那一项,而不显示通 ...

  5. 创建第一个 local network(I) - 每天5分钟玩转 OpenStack(80)

    在 ML2 配置文件中 enable local network 后,本节将开始创建第一个 local network. 我们将通过 Web GUI 创建第一个 local network. 首先确保 ...

  6. 窥探Swift编程之强大的Switch

    之前初识Swift中的Switch语句时,真的是让人眼前一亮,Swift中Switch语句有好多特有而且特好用的功能.说到Switch, 只要是写过程序的小伙伴对Switch并不陌生.其在程序中的出镜 ...

  7. Ubuntu杂记——Ubuntu下安装VMware

    转战Ubuntu,不知道能坚持多久,但是自己还是要努力把转战过程中的学习到的给记录下来.这次就来记录一下,Ubuntu下如何安装VMware. 就我所知,Linux下有VirtualBox和VMwar ...

  8. 测试驱动开发与Python

    最近在看一本书<Test-Driven Development with Python>,里面非常详细的介绍了如何一步一步通过测试驱动开发(TDD)的方式开发Web项目.刚好这本书中使用了 ...

  9. struts2学习笔记--OGNL表达式1

    struts2标签库主要使用的是OGNL语言,类似于El表达式,但是强大得多,它是一种操作对象属性的表达式语言,OGNL有自己的优点: 能够访问对象的方法,如list.size(); 能够访问静态属性 ...

  10. asp.net 无法加载程序集***

    1.vs2008,asp.net出现无法加载程序集...错误信息.可以通过删除项目的dll文件,重新编译运行解决问题. 2.我在global文件中的applicaiton_start开启了一个线程,不 ...