安装PHP出现make: *** [sapi/cli/php] Error 1 解决办法
ext/iconv/.libs/iconv.o: In function `php_iconv_stream_filter_ctor':
/home/king/php-5.2.13/ext/iconv/iconv.c:2491: undefined reference to `libiconv_open'
collect2: ld returned 1 exit status
make: *** [sapi/cli/php] Error 1
[root@test php-5.2.13]# vi Makefile
在安裝 PHP 到系统中时要是发生「undefined reference to libiconv_open'」之类的错误信息,那表示在「./configure 」沒抓好一些环境变数值。错误发生点在建立「-o sapi/cli/php」是出错,没給到要 link 的 iconv 函式库参数。 解决方法:编辑Makefile 大约77 行左右的地方: EXTRA_LIBS = ..... -lcrypt 在最后加上 -liconv,例如: EXTRA_LIBS = ..... -lcrypt -liconv 然后重新再次 make 即可。
或者用另一种办法
make ZEND_EXTRA_LIBS='-liconv'
ln -s /usr/local/lib/libiconv.so.2 /usr/lib64/
安装PHP出现make: *** [sapi/cli/php] Error 1 解决办法的更多相关文章
- php编译安装报错:make: *** [sapi/cli/php] Error 1 解决办法
ext/iconv/.libs/iconv.o: In function `php_iconv_stream_filter_ctor':/ext/iconv/iconv.c:2491: undefin ...
- 转:安装PHP出现make: *** [sapi/cli/php] Error 1 解决办法
ext/iconv/.libs/iconv.o: In function `php_iconv_stream_filter_ctor':/home/king/PHP-5.2.13/ext/iconv/ ...
- 转 安装PHP出现make: *** [sapi/cli/php] Error 1 解决办法
ext/iconv/.libs/iconv.o: In function `php_iconv_stream_filter_ctor':/home/king/php-5.2.13/ext/iconv/ ...
- make: *** [sapi/cli/php] Error 1 解决办法
make: *** [sapi/cli/php] Error 1 一:考虑过make clean,问题依然 二:(采取此方法后出现启动apache报错:/usr/local/apache2/modul ...
- eclipse-jee-luna安装ADT-23.0.6出现的问题,以及解决办法
刚安装好ADT-23.0.6,然后配置sdk路径(最新的版本android-22),然后创建一个新的Android Project; 对于布局界面会出现如下错误,导致无法显示布局界面: java.la ...
- CentOS7安装vncserver(启动失败及连接黑屏解决办法)
CentOS7安装vncserver(启动失败及连接黑屏解决办法) 转载weixin_34167043 最后发布于2017-11-09 15:11:00 阅读数 42 收藏 展开 AutoSAR入门 ...
- dell r710 安装ubuntu 12.04 server 启动后进入initramfs解决办法
dell r710 安装ubuntu 12.04 server 启动后进入initramfs解决办法 grub 启动菜单后加入 rootdelay=90, 如下:/boot/vmlinuz-2.6.3 ...
- MAC安装MacPorts 卡在“正在运行软件包脚本”的解决办法
MAC安装MacPorts 卡在"正在运行软件包脚本"的解决办法 点击右上角强制结束掉"安装器" 打开terminal, 输入命令"ps -ef | ...
- 遇到的Exception/error及解决办法记录汇总
一.java.net.SocketException 1.java.net.SocketException:Connection reset 首先,如果一端的Socket被关闭(或主动关闭,或因为异常 ...
随机推荐
- failed with: java.lang.NullPointerException
failed with: java.lang.NullPointerException 需要在nutch的配置文件 'conf/nutch-site.xml'. 里设置如下,不然就报上面的错误了. 当 ...
- 小心loadrunner成为瓶颈
最近在测试中发现一个问题,某些时候用进程跑场景的时候tps死活上不去,而用同样数量的线程跑的时候,TPS开始很高,然后很快的跌倒谷底.当遇到这个问题的时候往往就是loadrunner成为瓶颈了! 解决 ...
- UVALive 5903 Piece it together
一开始用的STL一直超时不能过,后来发现AC的代码基本都用的普通邻接表,然后改了一下13s,T=T,效率太低了.然后把某大神,详情戳链接http://acm.hust.edu.cn/vjudge/pr ...
- [jobdu]用两个栈实现队列
思路比较简单.就是当要pop的时候,如果s2为空,才把s1的转过来.总之就是区分一下此时s2为空和非空的情况. http://ac.jobdu.com/problem.php?pid=1512 #in ...
- 网络基本功(八):细说TCP滑动窗口
https://community.emc.com/message/842129#842129
- 图片缩放时java.lang.IllegalArgumentException: pointerIndex out of range解决方案
版权声明:本文为博主原创文章,未经博主允许不得转载. 06-03 20:45:24.143: E/AndroidRuntime(1230): FATAL EXCEPTION: main06-03 20 ...
- Android WebView 开发详解(二)
转载请注明出处 http://blog.csdn.net/typename/article/details/39495409 powered by miechal zhao 概览: Androi ...
- VC多文档编程技巧(取消一开始时打开的空白文档)
VC多文档编程技巧(取消一开始时打开的空白文档) http://blog.csdn.net/crazyvoice/article/details/6185461 VC多文档编程技巧(取消一开始时打开的 ...
- rails3 Bundle简介
Rails 3开始使用bundle来管理项目的gem依赖.该命令只在一个含有Gemfile的目录下执行. Gemfile: Rails 项目所有的依赖包都在这里配置,不像以前通过require来查找 ...
- wcf iis host 打开exe失败 不能显示界面
最近谷歌没法用了,我的freegate经常性的崩溃 无奈之下,用了必应,貌似也不错 http://stackoverflow.com/questions/8414514/iis7-does-not-s ...