今天来打开Eclipse 报错了,错误信息如下:

[2015-08-01 09:07:43 - Android SDK] Error when loading the SDK:

Error: Error parsing D:\Android\Eclipse\sdk\system-images\android-22\android-wear\armeabi-

v7a\devices.xml
cvc-complex-type.2.4.d: 发现了以元素 'd:skin' 开头的无效内容。此处不应含有子元素。
Error: Error parsing D:\Android\Eclipse\sdk\system-images\android-22\android-wear \x86\devices.xml
cvc-complex-type.2.4.d: 发现了以元素 'd:skin' 开头的无效内容。此处不应含有子元素。

百度了一下有如下两种解决方法:

方法1:

在SDK Manager里删除Android-wear相关的image

方法2:

进入sdk目录下,把..\android-sdk\system-images\android-22\android-wear\armeabi-v7a\devices.xml和..\android-sdk\system-images\android-22\android-wear\x86\devices.xml文件删除,再把sdk里面..\android-sdk\tools\lib\下的devices.xml拷贝到上述两个文件夹里,重启eclipse即可

我使用了方法2,解决了此问题,在此记录一下。

====================================================================================

  作者:欧阳鹏  欢迎转载,与人分享是进步的源泉!

  转载请保留原文地址:http://blog.csdn.net/ouyang_peng

====================================================================================

我的Android进阶之旅------>解决Bug:打开eclipse报错,发现了以元素 'd:skin' 开头的无效内容。此处不应含有子元素。的更多相关文章

  1. Android小经验:启动Eclipse,出现提示“......发现了以元素'd:skin'开头的无效内容。此处不应含有子元素...”

    如图所示: 解决办法: 进入sdk目录下,把D:\android-sdks\system-images\android-22\android-wear\armeabi-v7a\devices.xml和 ...

  2. Eclipse打开时“发现了以元素'd:skin'”开头的无效内容。此处不应含有子元素的解决方法

    把有问题的 devices.xml 文件删除,再在sdk 里面 tools\lib 下找到devices.xml 文件,将这个文件拷贝到你删除的那个文件夹里,重启 eclipse 就 OK 啦!

  3. 我的Android进阶之旅------>解决Jackson等第三方转换Json的开发包在开启混淆后转换的实体类数据都是null的bug

    1.错误描述 今天测试人员提了一个bug,说使用我们的app出现了闪退的bug,后来通过debug断点调试,发现我们的app转换服务器发送过来的json数据后,都是为null.而之前已经提测快一个月的 ...

  4. 我的Android进阶之旅------>解决:Failed to create 'build\outputs\apk\watch-debug-unaligned.apks': 拒绝访问。

    1. 错误描述 今天用Android Studio进行项目编译的时候,报错如下所示: FAILURE: Build failed with an exception. * What went wron ...

  5. 我的Android进阶之旅------>解决Android Studio报错:DefaultAndroidProject : Unsupported major.minor version 52.0

    问题描述 今天使用Android Studio 2.0打开我之前的项目时,编译报了如下错误: Error:Cause: com/android/build/gradle/internal/model/ ...

  6. 我的Android进阶之旅------>解决Error:Could not find property 'compile' on org.gradle.api.internal.artifacts.

    1错误描述 解决方法 1错误原因 2解决方法 1.错误描述 刚刚,Android Studio突然编译不了了,报了如下错误: Error:Could not find property 'compil ...

  7. 我的Android进阶之旅------>解决Jackson、Gson解析Json数据时,Json数据中的Key为Java关键字时解析为null的问题

    1.问题描述 首先,需要解析的Json数据类似于下面的格式,但是包含了Java关键字abstract: { ret: 0, msg: "normal return.", news: ...

  8. 我的Android进阶之旅------>解决错误: java.util.regex.PatternSyntaxException: Incorrect Unicode property

    1.错误描述 今天使用正则表达式验证密码的时候,报了错误 java.util.regex.PatternSyntaxException: Incorrect Unicode property near ...

  9. 我的Android进阶之旅------>解决Android Studio编译后安装apk报错:The APK file does not exist on disk

    1.错误描述 今天用Android Studio编译应用后安装APK的时候,报错了,错误如下所示: The APK file build\outputs\apk\OYP_2.3.4_I2Base_64 ...

随机推荐

  1. Atitit.java jna 调用c++ dll 的总结

    Atitit.java jna 调用c++ dll 的总结 1. JNA技术解密1 1.1. JNA工作原理1 2. JNA技术难点 Java—C和操作系统数据类型的对应表1 2.1. 1 2.2.  ...

  2. 如何将webbrowser控件的Cookie倒入CookieContainer供WebRequest使用

    先建一个 "CookieContainer "   把WebBrowser中的Cookie保存在里面                       //在WebBrowser中登录 ...

  3. 【转】jQuery.extend 函数详解

    原文地址:http://www.cnblogs.com/RascallySnake/archive/2010/05/07/1729563.html JQuery的extend扩展方法:      Jq ...

  4. dubbo_分布式Rpc服务

    dubbo是一个分布式的服务架构,可直接用于生产环境作为SOA服务或Rpc服务 1.下载,编译,运行demo  1).安装zookeeper    下载:http://apache.claz.org/ ...

  5. C/C++ 错误笔记-如果要释放内存,必须拿到内存的首地址进行释放

    例:修改字符串的第三个字母为a #include <stdlib.h> #include <string.h> #include <stdio.h> #pragma ...

  6. 转:关于安卓多线程while(true)方法占用CPU高的原因及其解决方法

    由于项目需要用到安卓多线程操作,结果开了四条线程,下载到平板一直很卡,CPU占用率暴涨.于是开始查找原因,发现是线程run()方法里的while(true)导致的, 下图是为解决时开启一条while( ...

  7. pthread_cleanup_push和pthread_cleanup_pop清除函数是否执行的说明

    示例1: #include <stdio.h> #include <pthread.h> void* clean(void* arg) { printf("clean ...

  8. Google Chrome v48.0.2564.

    http://www.pcpop.com/doc/1/1819/1819996.shtml 摘要:谷歌浏览器Chrome Stable 稳定版迎来例行升级,新版本号为v48.0.2564.82,上一版 ...

  9. undefined reference to `shm_unlink'

    1.问题描述: 在编译一个程序的时候提示这样的错误: BLog.cpp:(.text+0x5fc): undefined reference to `shm_unlink'DBLog.cpp:(.te ...

  10. linux下调试使用的 一些shell命令

    查看文件日期:strings |grep Build gdb g++ gcc make systemctl gdb: bt s n b 1.firewalld的基本使用 启动: systemctl s ...