gradle编译出错:Execution failed for task ':app:compileTestDebugJava'.
今天更新了android studio,从0.5.3升级到0.6.1版本,结果在IDE中编译时没有问题,但是在命令行时编译就会出现以下错误:
:app:compileTestDebugJava FAILED FAILURE: Build failed with an exception. * What went wrong: Execution failed for task ':app:compileTestDebugJava'. > No signature of method: com.android.build.gradle.AppPlugin.getRuntimeJarList() is applicable for argument types: () values: []
我随着更新gradle到1.12,问题同样存在。
貌似是gradle更新之后,里面的单元测试插件未更新。各种谷歌,找到了这个地址:https://github.com/robolectric/robolectric-gradle-plugin。于是换用原来的插件为这一个,修改如下(参照该项目的README):将以下内容:
dependencies {
classpath 'com.squareup.gradle:gradle-android-test-plugin:0.9.1-SNAPSHOT'
}
修改为:
dependencies {
classpath 'org.robolectric:robolectric-gradle-plugin:0.11.+'
}
同时把apply plugin: 'android-test' 修改为apply plugin: 'robolectric'
再运行Gradle clean build,成功。
gradle编译出错:Execution failed for task ':app:compileTestDebugJava'.的更多相关文章
- 打包APK出现org.gradle.api.tasks.TaskExecutionException: Execution failed for task ':app:lintVitalRelease'.
AndroidS Studio打包APK时出现问题:org.gradle.api.tasks.TaskExecutionException: Execution failed for task ':a ...
- Android中使用databinding编译时出现的error:Execution failed for task ':app:dataBindingProcessLayoutsDebug'
Windows环境下使用svn对AndroidStudio更新代码时,总会在源文件中出现一堆乱码,尤其是xml文件中的乱码,不仅找起来费劲,改起来更费劲. 最近从svn更新代码之后,编译时出现了下面这 ...
- Android Studio 编译错误 Error:Execution failed for task ':app:buildInfoDebugLoader'.
今天来到打开昨天的项目运行正常,然后改动了一点代码编译报错: Error:Execution failed for task ':app:buildInfoDebugLoader'. > Exc ...
- Android:Error:Execution failed for task ':app:transformResourcesWithMergeJavaResForDebug'.
今天开发Android项目时,导入了http有关架包后,程序编译报错如下: Error:Execution failed for task ':app:transformResourcesWithMe ...
- 我的Android进阶之旅------>解决:Execution failed for task ':app:transformResourcesWithMergeJavaResForDebug'.
错误描述 今天在Android Studio项目中加入了jackson的开发包,编译运行时候,引发了如下的错误: Error:Execution failed for task ':app:trans ...
- Error:Execution failed for task ':app:transformClassesWithDexForDebug'.
使用android studio 时,编译成功但用build apk时却报错 环境: android studio 1.5, jdk1.7 错误:Error:Execution failed for ...
- Error:Execution failed for task ':app:dexDebug'. > com.android.ide.common.process.ProcessException
异常Log: Error:Execution failed for task ‘:app:dexDebug’. > com.android.ide.common.process.ProcessE ...
- 关于android studio 出现Error:Execution failed for task ':app:preDebugAndroidTestBuild'. 的解决办法
Error:Execution failed for task ':app:preDebugAndroidTestBuild'. > Conflict with dependency 2018年 ...
- Error:Execution failed for task ':app:transformClassesWithDexForDebug'. > com.android.build.api.transform.TransformException: com.android.ide.common.process.ProcessException: java.util.concurrent.Exec
Error:Execution failed for task ':app:transformClassesWithDexForDebug'.> com.android.build.api.tr ...
随机推荐
- Gradle学习之闭包
Gradle中的闭包其实就等同于Groovy中闭包,Groovy是一种jvm语言,语法兼容于java,曾几何时,也在脚本语言中独树一帜,初学Gradle的时候,大家很容易被其语法所迷惑,由于Gradl ...
- 如何在Google上下载高清原图
在我们学习和生活中常常一些高清图片作为相关的素材,比如制作PPT.写博文.制作视频都需要大量图片.我们常常会在百度上下载一些图片,但是百度上提供的图片存在很多问题:存在水印.清晰度不够等.而Googl ...
- Jenkins持续集成环境, 如何自定义 maven 仓库
最后的解决方法: job-->configure-->Build-->Goals and options: clean package -Dmaven.repo.local=D:\d ...
- 指尖大冒险H5小游戏
前些天看了一篇很赞的文章,又因为想学习phaser,所以有了这个案例,在线预览可以点下方链接. 本案例中,核心原理是按文章中所提到的内容制作,整体遵循"大道至简"的原则开发,其实是 ...
- angular.run和angular.config的区别
ng的运行机制: config阶段是给了ng上下文一个针对constant与provider修改其内部属性的一个阶段 而run阶段是在config之后的在运行独立的代码块,通常写法runBlock 简 ...
- HTMLParser使用简介
HTMLParser具有小巧,快速的优点,缺点是相关文档比较少(英文的也少),很多功能需要自己摸索.对于初学者还是要费一些功夫的,而一旦上手以后,会发现HTMLParser的结构设计很巧妙,非常实用, ...
- WPF ListBox 获取listBoxItem
1.已知item的DataContext,获取ListBoxItem 1)ItemContainerGenerator.ContainerFromItem var selectedItem = Doc ...
- 微信小程序--试水
应公司需求,接手小程序,在此之前我是一点也没有接触过,对此,拿过小程序文档和官方案例就一顿恶补,在此期间也看过一些小程序建立模型的视频,终于对小程序知晓一二,拿过项目开始研究.好了废话不多说,总结一下 ...
- Go 语言指针
Go 语言中指针是很容易学习的,Go 语言中使用指针可以更简单的执行一些任务. 接下来让我们来一步步学习 Go 语言指针. 我们都知道,变量是一种使用方便的占位符,用于引用计算机内存地址. Go 语言 ...
- 安卓高级8 SurfaceView案例三 结合mediaplay播放视频
我们知道mediaplay无法直接播放视频所以我们结合Surface package qianfeng.com.mediaplayerdemo; import android.media.MediaP ...