g2o编译出现的问题及解决办法 By not providing "FindG2O.cmake" in CMAKE_MODULE_PATH this project has
在安装完该g2o之后 运行一些程序 如高翔的ch6 代码会出现如下错误:
CMake Warning at CMakeLists.txt:10 (FIND_PACKAGE):
By not providing "FindG2O.cmake" in CMAKE_MODULE_PATH this project has
asked CMake to find a package configuration file provided by "G2O", but
CMake did not find one. Could not find a package configuration file provided by "G2O" with any of
the following names: G2OConfig.cmake
g2o-config.cmake Add the installation prefix of "G2O" to CMAKE_PREFIX_PATH or set "G2O_DIR"
to a directory containing one of the above files. If "G2O" provides a
separate development package or SDK, be sure it has been installed.
解决方式很简单:
主要是CMakeLists.txt上要修改几行代码
本来是这样的就会报错:
list( APPEND CMAKE_MODULE_PATH ${PROJECT_SOURCE_DIR}/cmake )
find_package(G2O REQUIRED)
include_directories(
${G2O_INCLUDE_DIRS} )
修改为:
list( APPEND CMAKE_MODULE_PATH /home/×××/g2o/cmake_modules )
set(G2O_ROOT /usr/local/include/g2o)
find_package(G2O REQUIRED)
include_directories(
${G2O_INCLUDE_DIRS} )
然后再cmake便不会出现问题了。
主要原因就是原始代码中的下面一句代码:
${PROJECT_SOURCE_DIR}/cmake
是ch6文件夹中原来就包含的cmake文件夹中FindG2O.cmake在你的文件夹不存在,只要把list那行路径改到FindG2O.cmake存在的文件夹就行。
原文链接:g2o编译出现的问题及解决办法 By not providing "FindG2O.cmake" in CMAKE_MODULE_PATH this project has
g2o编译出现的问题及解决办法 By not providing "FindG2O.cmake" in CMAKE_MODULE_PATH this project has的更多相关文章
- PHP编译安装时常见错误解决办法,php编译常见错误
PHP编译安装时常见错误解决办法,php编译常见错误 1.configure: error: xslt-config not found. Please reinstall the libxslt & ...
- ARM64平台编译stream、netperf出错解决办法 解决办法:指定编译平台为alpha [root@localhost netperf-2.6.0]# ./configure –build=alpha
ARM64平台编译stream.netperf出错解决办法 http://ilinuxkernel.com/?p=1738 stream编译出错信息: [root@localhost stream]# ...
- Visual Studio Xamarin编译Android项目出错的解决办法
安装完Xamarin后,编译Android项目时,你会发现好长时间进度都不动,当你取消编译后,会发现其实是出错了,就是因在Android项目在第一次编译时要去google网站上下一个andorid s ...
- 在Linux下安装PHP过程中,编译时出现错误的解决办法
在Linux下安装PHP过程中,编译时出现configure: error: libjpeg.(a|so) not found 错误的解决办法 configure: error: libjpeg.(a ...
- [转]编译Android源代码常见错误解决办法
1. 编译时出现/usr/bin/ld: skipping incompatible /usr/lib/gcc/x86_64-linux-gnu/4.4.5/../../../libz.so when ...
- X265编译中C2220错误的解决办法
x265编译过程中 C2220错误:根本原因是代码是英文代码页,而我们的操作系统中使用的是中文代码页: 解决办法1 逐个文件进行格式转换,我在ubuntu下用iconv命令试过,没成功: 解决办法2 ...
- vue-cli 打包编译 -webkit-box-orient: vertical 被删除解决办法
前言 -webkit-box-orient: vertical在本地开发环境运行都没问题,一旦打包以后就会丢失 正文 原因: -webkit-box-orient: vertical 这个属性被 o ...
- linux下编译出现tmp空间不足解决办法
编译的时候出现问题: fatal error: error writing to /tmp/ccHqgMoi.s: No space left on device 原因 : 系统 /tmp/空间不足, ...
- Sass编译时Invalid US-ASCII character解决办法
编译scss文件时,如果出现如下错误 Error: Invalid US-ASCII character "\xC2" on line 63 of src/assets/_scss ...
- php编译中遇到种种error解决办法
http://my.oschina.net/maczhao/blog/365176 编译PHP5.5 make 时出现错误 make: *** [ext/fileinfo/libmagic/appre ...
随机推荐
- 工作使用:Exchange命令集(超级重要)
工作使用:Exchange命令集(超级重要) 命令1:导出某个用户的邮件 New-MailboxExportRequest -mailbox dusonglin ...
- Exchange限制邮箱用户每天/每分钟的发送邮件数量和速率
Exchange限制邮箱用户每天/每分钟的发送邮件数量和速率 近期遇到部分Exchange客服反馈内部邮箱账号密码被盗,给内部其他同事和外部邮箱发送大量钓鱼和诈骗邮件:对公司造成很大负面影响和经济损失 ...
- Java解析HJ212环保报文
Java解析HJ212环保报文 toMap方法对报文进行基础的解析 /** * HJ212报文转换为标准化的Map * @param str HJ212报文 * @return */ public s ...
- KubeSphere 社区双周报|2024.02.01-02.29
KubeSphere 社区双周报主要整理展示新增的贡献者名单和证书.新增的讲师证书以及两周内提交过 commit 的贡献者,并对近期重要的 PR 进行解析,同时还包含了线上/线下活动和布道推广等一系列 ...
- SQLServer数据库事务级别
EFCore自动创建的数据库在SQLSERVER时是READ_COMMITTED_SNAPSHOT,SQLSERVER创建数据库默认是READ_COMMITTED. 因此记录一下查看和修改的方法,以便 ...
- 设计卷积神经网络CNN为什么不是编程?
上一篇:<搞清楚这个老六的真面目!逐层'剥开'人工智能中的卷积神经网络(CNN)> 序言:现在让我们开始走进卷积神经网络(CNN)的世界里.和传统编程完全不同,在人工智能的程序代码里,您看 ...
- Nuxt.js 应用中的 nitro:config 事件钩子详解
title: Nuxt.js 应用中的 nitro:config 事件钩子详解 date: 2024/11/2 updated: 2024/11/2 author: cmdragon excerpt: ...
- WIN10 SERVICES -- 部署IIS
一 . 添加角色功能 二. 添加WEB服务器(IIS) 三. 打开TCP ASP.NET 安装 供运行端口
- 780E开发板之errDump错误日志上报,操作方法解析
一.errDump功能 LuatOS-Air错误日志上报功能模块名叫:errDump,errDump对"量产投放市场的设备,远程调试初步定位问题"至关重要,强烈建议客户一定要使 ...
- fastadmin-表单使用
1.日期时间 在FastAdmin中的日期时间组件采用的是Bootstrap-datetimepicker插件,官方文档:Bootstrap-datetimepicker官方教程 日期时间格式设置:设 ...