【转】解决编译安装NGINX时make报错
编译参数:
--[root@localhost nginx-1.4.6]# ./configure --user=nginx --group=nginx --prefix=/usr/local/nginx --with-http_stub_status_module --with-http_ssl_module --with-pcre=/usr/local/pcre/
NGINX编译通过后,make时报错如下:
[root@localhost nginx-1.4.6]# make make -f objs/Makefile make[1]: Entering directory `/usr/src/nginx-1.4.6' cd /usr/local/pcre/ \ && if [ -f Makefile ]; then make distclean; fi \ && CC="cc" CFLAGS="-O2 -fomit-frame-pointer -pipe " \ ./configure --disable-shared /bin/sh: line 2: ./configure: No such file or directory make[1]: *** [/usr/local/pcre//Makefile] Error 127 make[1]: Leaving directory `/usr/src/nginx-1.4.6' make: *** [build] Error 2 [root@localhost nginx-1.4.6]#
主要错误:make[1]: *** [/usr/local/pcre//Makefile] Error 127
查看了下帮助
[root@localhost nginx-1.4.6]# ./configure --help | grep '\--with-pcre' --with-pcre force PCRE library usage --with-pcre=DIR set path to PCRE library sources --with-pcre-opt=OPTIONS set additional build options for PCRE --with-pcre-jit build PCRE with JIT compilation support [root@localhost nginx-1.4.6]#
发现--with-pcre=DIR是设置pcre的源码目录,而不是pcre的安装目录
重新修改Nginx编译参数
[root@localhost nginx-1.4.6]# ./configure --user=nginx --group=nginx --prefix=/usr/local/nginx --with-http_stub_status_module --with-http_ssl_module --with-pcre=/usr/src/pcre-8.10/
编译通过后执行make && make install 都应该不会有问题
【转】解决编译安装NGINX时make报错的更多相关文章
- 安装vue-cli时-4058报错的解决方法
一.报错信息 安装vue-cli时-4058报错 二.解决办法 1.安装淘宝镜像 npm --registry https://registry.npm.taobao.org info undersc ...
- 编译安装nginx时配置开机自启
详细编译安装nginx请参考[Nginx目录结构与配置文件详解]以及[Nginx安装部署],在这里就进行简单安装 安装Nginx 环境介绍 操作系统: [root@localhost ~]# cat ...
- 按照教程自动安装RFNoC时.在使用pip安装pybombs时出现报错,解决办法
$ sudo apt-get install git $ sudo apt-get install python-setuptools python-dev python-pip build-esse ...
- 解决小米手机USB安装apk时AS报错:INSTALL_FAILED_USER_RESTRICTED
今天,直接用AS在小米手机上运行安装的时候总是报错:INSTALL_FAILED_USER_RESTRICTED,于是乎,通过以下方式解决: 在开发者选项将USB安装打开,然后,哈,解决了.记录一下.
- 编译安装php-5.3.27报错:make: *** [sapi/fpm/php-fpm] 错误 1
安装PHP的时候make报错:make: *** [sapi/fpm/php-fpm] Error 1 原因:Centos6.8之后已经将iconv库加进来了,如果再安装libiconv库相当于重复一 ...
- Python安装pip时, 报错:zipimport.ZipImportError: can't decompress data; zlib not available
解决办法: 1.安装依赖zlib.zlib-devel 2.重新编译安装Python 具体步骤: 1 到python安装目录下,运行./configure 2 编辑Modules/Setup文件 vi ...
- 安装HDP时的报错信息
1,安装ambari时报错:Bootstrap process timed out. It will be destroyed. 报错原因:/etc/sudoers文件中未设置免密权限 解决办法:ha ...
- Yum编译安装Error Downloading Packages报错
1:执行yum clean all 清除缓存目录下的软件包及旧的headers: 2:接着执行 yum list重新列出所有已经安装和可以安装的软件包: 3:重新执行上述命令,发现yum编译成功: 注 ...
- pip安装selenium时,报错“You are using pip version 10.0.1, however version 18.0 is available.”的问题
pip安装selenium,pip install selenium 类型这样错误 1 原因可能不是以管理员身份运行cmd安装selenium 2 解决方式 也是要管理员身份运行 重点在最后一句 ...
随机推荐
- centos 更新python
1.CentOS安装Python的依赖包 yum groupinstall "Development tools"yum install zlib-devel bzip2-deve ...
- s3c2440 移值u-boot-2016.03 第4篇 支持NAND flash 识别
1, /include/configs/smdk2440.h 中添加 #define CONFIG_CMD_NAND 编译 drivers/mtd/nand/built-in.o: In functi ...
- [已解决] java.net.InetAddress.getHostName() 阻塞问题
在学习java nio的过程中发现某些情况下使用该方法会导致程序阻塞,(情况:服务器,Linux:客户端,WIN10) java.net.InetAddress.getHostName() 阻塞情况如 ...
- Digital Roots 1013
Digital Roots 时间限制(普通/Java):1000MS/3000MS 运行内存限制:65536KByte总提交:456 测试通过:162 描述 T ...
- GnuPG 的PGP使用
1. 生成秘钥对(此处采用默认的RSA, 2048位) $ gpg --gen-key gpg (GnuPG) ; Copyright (C) Free Software Foundation, In ...
- easylui datagrid 动态生成列
function load(sdate) { $.getJSON("workorder/statistics.do", { sdate : sdate+'-01' }, funct ...
- 升级PHP
wget http://down.wdlinux.cn/in/php_up53.shsh php_up53.sh
- Hadoop笔记HDFS(2)
高级Hadoop MapReduce管理 1 调试部署好的Hadoop的配置 2 运行基准测试检验Hadoop的安装 3 重新利用JVM提升性能 4 容错性 5 调试脚本-分析失败任务原因 6 设置失 ...
- 单调队列 hdu2823
Sliding Window Time Limit: 12000MS Memory Limit: 65536K Total Submissions: 48608 Accepted: 14047 ...
- Java开发中经典的小实例-(字符串比较)
//输入字符串然后与自己定义的数组进行对比,并输出重复次数. public class Test11 { public static void main(String[] args) { ...