使用Docker安装PaddlePaddle安装过程中出现的几个问题
Unable to create: 已停止该运行的命令,因为首选项变量“ErrorActionPreference”或通用参数设置为 Stop: 无法新建虚拟机。
“MobyLinuxVM”无法实现。(虚拟机 ID 007A6003-90D1-4369-BD8C-75703089EE73)
这个问题是因为Docker的安装问题,出现这个问题一般是当前Windows 的版本不合适当前的Docker,需要安装Docker ToolBox的问题。
Error creating machine: Error in driver during machine creation: read tcp 12
这个问题可以看到你桌面的Docker Quickstart Terminal 实际上指向的是git里面的bash.exe。但是们需要通过docker自己的启动端启动Docker 我的目录是C:\Users\LENOVO\AppData\Roaming\Microsoft\Windows\Start Menu\Programs\Docker
使用Docker安装PaddlePaddle安装过程中出现的几个问题的更多相关文章
- (转)CloudStack 安装及使用过程中常见问题汇总
CloudStack 安装及使用过程中常见问题汇总 在做工程项目中对CloudStack 安装及使用过程中常见的几个问题及如何解决做一个总结. 1.Windows XP虚拟 ...
- centos7安装Python3的过程中会和Python2.7版本冲突导致yum版本比对应,致使yum不能使用的问题。
centos7安装Python3的过程中会和Python2.7版本冲突导致yum版本比对应,致使yum不能使用的问题. 原因:yum调用Python,启动程/usr/bin/yum就是一个python ...
- Office2007在安装、卸载过程中出错的解决办法
Micorsoft office professional plus 2007在安装过程中出错,错误1706 如果在安装OFFICE 2007的 时候,遇到“Microsoft Office 2007 ...
- 安装CouchbaseClient的过程中提示 Error 1935.An error occurred during the installation of assembly;Error:-1603 fatal error during installation
安装过程中提示报错 点击确定后 安装程序会接着回滚,又提示报错如下 Error 1935的解决方法是下载一个微软的补丁. http://support.microsoft.com/de ...
- Oracle 安装安全补丁过程中出现的问题
为Oracle安装安全补丁,首先在官网上下载相应版本的补丁. 根据官方文档的说明安装,但是在安装的过程中会出项各种各样的错误,这里仅仅把我遇到的记录下来,给大家提供参考. 首先按照官方文档安装. 在这 ...
- 安装python caffe过程中遇到的一些问题以及对应的解决方案
关于系统环境: Ubuntu 16.04 LTS cuda 8.0 cudnn 6.5 Anaconda3 编译pycaffe之前需要配置文件Makefile.config ## Refer to h ...
- 我在MySQL免安装版使用过程中遇到的问题记录
我的MySQL版本为:mysql-5.7.16-winx64 安装时间为:2016年5月10号 由于是免安装版,下载好压缩文件之后解压到特定目录下,再打开命令行运行几行命令即可. 在一次操作中,发现无 ...
- Windows安装部署Tensorflow过程中的问题处理
1 在配置Tensorflow过程中有一行命令是 python object_detection/builders/model_builder_test.py 过程中出现了 NameError: na ...
- RVM的安装和使用过程中碰到的问题
Ruby Version Manager简称RVM,是一款非常好用的ruby版本管理以及安装工具. 关于rvm的安装,可以参考以下文章: use rvm install and manage ruby ...
随机推荐
- 函数传参和firture传参数request
前言 为了提高代码的复用性,我们在写用例的时候,会用到函数,然后不同的用例去调用这个函数.比如登录操作,大部分的用例都会先登录,那就需要把登录单独抽出来写个函数,其它用例全部的调用这个登陆函数就行.但 ...
- Selenium学习之==>WebDriverApi接口详解
浏览器操作 driver.back() # 后退 driver.forward() # 前进 driver.refresh() # 刷新 窗口操作 driver.get_window_size() # ...
- 【MM系列】SAP 各种冲销凭证
公众号:SAP Technical 本文作者:matinal 原文出处:http://www.cnblogs.com/SAPmatinal/ 原文链接:[MM系列]SAP 各种冲销凭证 前言部分 ...
- Our growth depends not on how many experiences we devour, but on how manywe digest.
rot. v/n. 腐烂 vibration.n. 震动 charcoal. n 木炭 wrinkle. v. 长皱纹 geometry. n. 几何学 walnut.n. 核桃 tailor. n. ...
- .net core 学习小结之 JWT 认证授权
新增配置文件 { "Logging": { "IncludeScopes": false, "Debug": { "LogLeve ...
- org.apache.ibatis.exceptions.PersistenceException: ### Error querying database. Cause: java.sql.SQLException: The server time zone value 'Öйú±ê׼ʱ¼ä' is unrecognized or represents mor
今天在用junit测试mybits程序是遇到一个问题,报错为: org.apache.ibatis.exceptions.PersistenceException: ### Error queryin ...
- es6 js数组常用方法
一:会改变自身的方法 1.array.push(element1, ...elementN) 添加一个或多个元素到数组的末尾,并返回数组新的长度 2.array.unshift(element1, . ...
- Selenium1.0与2.0介绍
Selenium的实现原理 首先,你要明确刚才建立的测试用例是基于Selenium 2.0,也就是Selenium + WebDriver的方案.其次,你需要知道,对Selenium而言,V1.0和V ...
- python中django中间件
一.中间件 所谓的中间件,就是存在socket和视图函数中间的一种相当于过滤的机构. 中间件共分为: (1)process_request(self,request) (2)process_view( ...
- 制作的第一个java小游戏
package java1; import java.awt.*; public class java1 extends Frame { //球桌和桌球图片 Image ball = Toolkit. ...