redhat 6安装python 3.7.4报错ModuleNotFoundError: No module named '_ctypes' make: *** [install] Error 1
问题描述:
今天在测试环境中,为了执行脚本,安装下python3命令,在执行make install的时候报错:
ModuleNotFoundError: No module named '_ctypes'
make: *** [install] Error 1
解决:
在网上找了一些方案,说要通过yum安装一个包:
yum install libffi-devel -y
于是安装了,可是执行make install还是报同样的错误。
接着:
make clean然后make insall还是报错。
再接着:
以为是环境变量的问题,退出主机用户重新登录,还是报错。
再接着:
make clean,重新执行configuire命令,然后make , make install,发现成功。
所以:应该是在检查环境的时候,配置指定了模块的位置信息,然后在make的时候使用了,yum安装之后,重新执行configure,加载最新的模块信息,就解决了该问题。
文档创建时间:2019年8月1日17:07:22
redhat 6安装python 3.7.4报错ModuleNotFoundError: No module named '_ctypes' make: *** [install] Error 1的更多相关文章
- 【python+beautifulsoup4】Python中安装bs4后,pycharm报错ModuleNotFoundError: No module named 'bs4'
本文主要分享关于在对应python版本中安装beautifulsoup之后,在代码执行时还会提示“No module named 'bs4'”的问题. 安装beautifsoup4 在命令窗口执行 p ...
- ubuntu上跑python连接pg,报错 ImportError: No module named psycopg2
ubuntu上跑python连接pg,报错 ImportError: No module named psycopg2 root@pgproxy1:~# python /home/zxw/PGWri ...
- Python报错ModuleNotFoundError: No module named 'numpy'
转载:https://blog.csdn.net/qq_39779233/article/details/103224712 Python报错ModuleNotFoundError: No modul ...
- centos7中python3.6报错ModuleNotFoundError: No module named '_ssl' 或者 Max retries exceeded with url: / (Caused by SSLError("Can't connect to HTTPS URL because the SSL module is not available.",))
如果在运行爬虫时报此错:requests.exceptions.SSLError: HTTPSConnectionPool(host='www.baidu.com', port=443): Max r ...
- centos下安装python3.7.0以上版本时报错ModuleNotFoundError: No module named '_ctypes'
centos下安装python3.7.0以上版本时报错ModuleNotFoundError: No module named '_ctypes'的解决办法 3.7版本需要一个新的包libffi-de ...
- pyinstaller打包多个py文件仍报错ModuleNotFoundError: No module named 'xxx'
[问题现象] 使用pyinstaller A.py -p b.py -p c.py打包多个文件 或者使用main.spec在Analysis配置好各个文件打包 打包成功后,运行main.exe仍然报错 ...
- Django 修改该项目文件夹、项目名及项目文件夹中同名文件夹,报错 ModuleNotFoundError: No module named 'untitled'
如果你直接重构项目文件夹名及重构项目名和重构项目文件夹内同名文件夹 执行项目报错 ModuleNotFoundError: No module named 'untitled' 请执行以下操作
- 运行Scrapy工程,报错ModuleNotFoundError: No module named 'win32api'解决方法
1.运行爬虫scrapy crawl name,报错ScrpyModuleNotFoundError: No module named 'win32api' 2.解决方法: 在https://gith ...
- Python中安装bs4后,pycharm依然报错ModuleNotFoundError: No module named 'bs4'
学习网络抓取时,第一步出现问题. 执行示例代码 from urllib.request import urlopen from bs4 import BeautifulSoup html = urlo ...
随机推荐
- 记一次win 2003 折腾pyspider遇到问题(pycurl)
把解决过程记录下来,帮助自己,帮助他人. 针对pyspider.win2003我安装的是python2.7.*.听我的吧.这绝对是一个明智的选择. 结果pycurl死活安装不上,试了网上给的方法:去h ...
- win黑窗口命令
rd 删除 文件夹, 语法: rd [/S] [/Q] [drive:]path 参数: drive 盘符 path 文件路径 /S 递归删除文件夹( 删除前, 要确认是否进行删除) /Q 关闭 ...
- Linux必知必会--sed
致沅弟:至于当大事,全在明强二字. --<曾国藩家书> 参考资料:https://man.linuxde.net/sed https://www.jianshu.com/p/047cd ...
- win7 创建vhd提示“找不到指定文件的虚拟磁盘支持提供程序”解决方法
本文参照:https://itbbs.pconline.com.cn/diy/16509116_2.html 14楼中"坚持不放弃"用户的答案得到解决 问题复现: 1.window ...
- javascript学习4、Function函数、伪数组arguments
一.Function函数基础 函数:就是将一些语句进行封装,然后通过调用的形式,执行这些语句. 1.函数的作用: 将大量重复的语句写在函数里,以后需要这些语句的时候,可以直接调用函数,避免重复劳动. ...
- flask实战-个人博客-程序骨架、创建数据库模型、临接列表关系 --
编写程序骨架 personalBlog的功能主要分为三部分:博客前台.用户认证.博客后台,其中包含的功能点如下图所示: 数据库 personalBlog一共需要使用四张表,分别存储管理员(Admin) ...
- 关于Certificate、Provisioning Profile
Certificate(证书)就是app在打包的时候必须签名,苹果iOS系统在安装app之前会验证Certificate,否则不会通过安装. Provisioning Profile简单来说就是包含A ...
- java内部类的本质
连接与通信,作为桥接中间件存在. 内部类和主体类可以无障碍通信: 1.通过继承连接实现: 2.通过接口连接通信: 形式: 1.命名空间: 2.运行上下文: 其它: 信息隐藏是次要功能. 内部类 Jav ...
- PHP获取一年有多少周和每周开始和结束日期
/*PHP获取当前日期是第几周和本周开始日期和本周结束日期*/ //$now = '2018-11-13';周二 public function getNowTimeInfo($now) { $str ...
- Tomcat不能访问ln -s软连接文件夹的前因后果
为了部署方便,把webapps下的大文件(图片等资源)放到工程外,通过软连接的方式设置 命令最常用的参数是-s,具体用法是:ln -s 源文件 目标文件. ln -s /usr/local/pic/i ...