cucumber测试项目报错
[INFO] Scanning for projects...
[WARNING]
[WARNING] Some problems were encountered while building the effective model for cn.x:credit_qa:jar:0.0.1-SNAPSHOT
[WARNING] 'dependencies.dependency.systemPath' for com.oracle:ojdbc6:jar should not point at files within the project directory, ${project.basedir}/libs/ojdbc6-11.2.0.3.jar will be unresolvable by dependent projects @ line 126, column 16
[WARNING]
[WARNING] It is highly recommended to fix these problems because they threaten the stability of your build.
[WARNING]
[WARNING] For this reason, future Maven versions might no longer support building such malformed projects.
[WARNING]
[INFO]
[INFO] ---------------------------< cn.x:credit_qa >---------------------------
[INFO] Building credit_qa 0.0.1-SNAPSHOT
[INFO] --------------------------------[ jar ]---------------------------------
[INFO]
[INFO] --- maven-resources-plugin:3.1.0:resources (default-resources) @ credit_qa ---
[INFO] Using 'UTF-8' encoding to copy filtered resources.
[INFO] Copying 0 resource
[INFO] Copying 2 resources
[INFO]
[INFO] --- maven-compiler-plugin:3.8.0:compile (default-compile) @ credit_qa ---
[INFO] Changes detected - recompiling the module!
[INFO] Compiling 1 source file to E:\git\credit_api\target\classes
[INFO] -------------------------------------------------------------
[ERROR] COMPILATION ERROR :
[INFO] -------------------------------------------------------------
[ERROR] No compiler is provided in this environment. Perhaps you are running on a JRE rather than a JDK?
[INFO] 1 error
[INFO] -------------------------------------------------------------
[INFO] ------------------------------------------------------------------------
[INFO] BUILD FAILURE
[INFO] ------------------------------------------------------------------------
[INFO] Total time: 0.775 s
[INFO] Finished at: 2019-02-12T11:58:37+08:00
[INFO] ------------------------------------------------------------------------
[ERROR] Failed to execute goal org.apache.maven.plugins:maven-compiler-plugin:3.8.0:compile (default-compile) on project credit_qa: Compilation failure
[ERROR] No compiler is provided in this environment. Perhaps you are running on a JRE rather than a JDK?
[ERROR] -> [Help 1]
[ERROR]
[ERROR] To see the full stack trace of the errors, re-run Maven with the -e switch.
[ERROR] Re-run Maven using the -X switch to enable full debug logging.
[ERROR]
[ERROR] For more information about the errors and possible solutions, please read the following articles:
[ERROR] [Help 1] http://cwiki.apache.org/confluence/display/MAVEN/MojoFailureException
已解决
修改pom
<project xmlns="http://maven.apache.org/POM/4.0.0"
xmlns:xsi="http://www.w3.org/2001/XMLSchema-instance"
xsi:schemaLocation="http://maven.apache.org/POM/4.0.0 http://maven.apache.org/xsd/maven-4.0.0.xsd">
<modelVersion>4.0.0</modelVersion>
<groupId>cn.x</groupId>
<artifactId>credit_qa</artifactId>
<version>0.0.1-SNAPSHOT</version> <parent>
<groupId>org.springframework.boot</groupId>
<artifactId>spring-boot-starter-parent</artifactId>
<version>2.1.0.RELEASE</version>
<relativePath /> <!-- lookup parent from repository -->
</parent> <properties>
<project.build.sourceEncoding>UTF-8</project.build.sourceEncoding>
<project.reporting.outputEncoding>UTF-8</project.reporting.outputEncoding>
<java.version>1.8</java.version>
</properties> <dependencies>
<dependency>
<groupId>org.springframework.boot</groupId>
<artifactId>spring-boot-starter-web</artifactId>
</dependency> <dependency>
<groupId>io.cucumber</groupId>
<artifactId>cucumber-java8</artifactId>
<version>4.2.0</version>
<scope>test</scope>
</dependency> <dependency>
<groupId>io.cucumber</groupId>
<artifactId>cucumber-spring</artifactId>
<version>4.2.0</version>
<scope>test</scope>
</dependency> <dependency>
<groupId>io.cucumber</groupId>
<artifactId>cucumber-junit</artifactId>
<version>4.2.0</version>
<scope>test</scope>
</dependency> <dependency>
<groupId>org.springframework.boot</groupId>
<artifactId>spring-boot-starter-test</artifactId>
<scope>test</scope>
</dependency> <dependency>
<groupId>org.springframework.boot</groupId>
<artifactId>spring-boot-starter-jdbc</artifactId>
</dependency> <dependency>
<groupId>org.mybatis.spring.boot</groupId>
<artifactId>mybatis-spring-boot-starter</artifactId>
<version>1.3.2</version>
</dependency> <dependency>
<groupId>com.squareup.okhttp3</groupId>
<artifactId>okhttp</artifactId>
<version>3.11.0</version>
</dependency> <dependency>
<groupId>com.squareup.okio</groupId>
<artifactId>okio</artifactId>
<version>1.14.0</version>
</dependency> <dependency>
<groupId>com.google.code.findbugs</groupId>
<artifactId>jsr305</artifactId>
<version>3.0.2</version>
</dependency> <dependency>
<groupId>org.conscrypt</groupId>
<artifactId>conscrypt-openjdk-uber</artifactId>
<version>1.1.4</version>
</dependency> <dependency>
<groupId>com.alibaba</groupId>
<artifactId>fastjson</artifactId>
<version>1.2.49</version>
</dependency>
<dependency>
<groupId>com.alibaba</groupId>
<artifactId>druid</artifactId>
<version>1.1.12</version>
</dependency>
<dependency>
<groupId>com.squareup.retrofit2</groupId>
<artifactId>retrofit</artifactId>
<version>2.5.0</version>
</dependency>
<dependency>
<groupId>com.squareup.retrofit2</groupId>
<artifactId>converter-gson</artifactId>
<version>2.5.0</version>
</dependency>
<dependency>
<groupId>com.squareup.retrofit2</groupId>
<artifactId>adapter-rxjava</artifactId>
<version>2.5.0</version>
</dependency>
<dependency>
<groupId>mysql</groupId>
<artifactId>mysql-connector-java</artifactId>
</dependency>
<dependency>
<groupId>com.oracle</groupId>
<artifactId>ojdbc6</artifactId>
<version>11.2.0.3</version>
<type>jar</type>
<scope>system</scope>
<systemPath>${project.basedir}/libs/ojdbc6-11.2.0.3.jar</systemPath>
</dependency> </dependencies> <build>
<pluginManagement>
<plugins>
<plugin>
<groupId>org.springframework.boot</groupId>
<artifactId>spring-boot-maven-plugin</artifactId>
</plugin>
<plugin>
<groupId>org.apache.maven.plugins</groupId>
<artifactId>maven-compiler-plugin</artifactId>
<version>3.8.0</version>
<configuration>
<source>1.8</source>
<target>1.8</target>
<encoding>UTF-8</encoding>
</configuration>
</plugin>
</plugins>
</pluginManagement>
</build> </project>
pom.xml
删除本地maven仓库
windows-preferences-java-installed jres-add,选择jdk目录
project上右键-maven-update project 选中force update of snapshot/releases-ok
cucumber测试项目报错的更多相关文章
- 安卓开发第一记 android stdio 安装后 新建测试项目报错
Failed to resolve:com.android.support:appcompat-v7:报错处理 你在使用android studio时是否也出现过上图的报错,你还在为它的出现烦恼? ...
- [原]Jenkins(八)---jenkins构建项目报错时发送错误报告邮件
/** * lihaibo * 文章内容都是根据自己工作情况实践得出. * 版权声明:本博客欢迎转发,但请保留原作者信息! http://www.cnblogs.com/horizonli/p/533 ...
- Eclipse开发Android项目报错解决方案详细教程,最新版一篇就够了!
本文记录刚接触Android开发搭建环境后新建工程各种可能的报错,并亲身经历漫长的解决过程(╥╯^╰╥),寻找各种偏方,避免大家采坑,希望能帮助到大家. 报错信息 出错一:The import and ...
- tomcat7 启动项目报错 java.lang.NoSuchMethodError: javax.servlet.ServletContext.getSessionCookieConfig()
JDK版本:jdk1.8.0_77 Tomcat 版本:apache-tomcat-7.0.47 异常重现步骤: 1.完成项目部署 2.启动Tomcat 异常头部信息:java.lang.NoSuch ...
- STS新建的maven项目报错问题
STS新建的maven项目报错问题 解决方法:打开pom.xml文件添加 <dependency> <groupId>javax.servlet</groupId> ...
- jacob 多个web项目报错 jacob-1.14.3-x64.dll already loaded in another classloader jacob
多个web项目报错 jacob-1.14.3-x64.dll already loaded in another classloader jacob 这个问题困扰了很久,网上很多解决方案,很多都不成功 ...
- myeclipse 10 载入新的项目报错Cannot return from outside a function or method
myeclipse 10 载入新的项目报错Cannot return from outside a function or method 解决方法: 方法一: window -->prefere ...
- 项目报错,tomcat中引起
1.项目报错,但发现工程并没有错.此刻错误应该定位如下,即工程里面引用的jar可能有错,可能是路劲变了....
- eclipse发布项目报错:Multiple Contexts hava a path of “/xxx“
你的位置:首页 > Java编程 > eclipse发布项目报错:Multiple Contexts hava a path of “/xxx“ eclipse发布项目报错:Multipl ...
随机推荐
- ArcPy 拷贝数据库
使用Python脚本进行图形数据库的拷贝. 原始帖子地址:https://www.2cto.com/database/201302/187391.html 整理Python代码: # -*- codi ...
- DevExpress TreeList 禁止节点拖动到其他节点上
背景 在做一个类似文件树的控件,支持节点从树上向其它的控件拖动程序,但是要保证树上的节点不能拖动上其他的节点上. 代码 /// <summary> /// 拖动节点完成 /// </ ...
- Android为TV端助力 Linux命令查看包名类名
先运行apk 再输入logcat | grep START 查看当前启动apk的包名和类名 adb shell "pm list packages -f | grep com.yulong. ...
- LeetCode算法题-Find Pivot Index(Java实现)
这是悦乐书的第304次更新,第323篇原创 01 看题和准备 今天介绍的是LeetCode算法题中Easy级别的第172题(顺位题号是724).给定一个整数nums数组,编写一个返回此数组的" ...
- 在html代码中js的script标签建议放在那里?
今天编写了一个简单的js代码,F12有错误,然后发现是<script>放的位置有问题.之前在我的印象当中,说的是这个标签放在哪里都可以,然而...并不是这样的,例如我现在练习的这个代码,写 ...
- 闲谈2-sat问题
问题简介 在计算机科学中,布尔可满足性问题(有时称为命题可满足性问题,缩写为SATISFIABILITY或SAT)是确定是否存在满足给定布尔公式的解释的问题.换句话说,它询问给定布尔公式的变量是否可以 ...
- Python学习案例之人脸检测识别
前言 随着科技的发展,人脸识别技术在许多领域得到的非常广泛的应用,手机支付.银行身份验证.手机人脸解锁等等. 识别 废话少说,这里我们使用 opencv 中自带了 haar人脸特征分类器,利用训练好的 ...
- 随心测试_数据库_003 <数据库存储结构>
接上篇:了解了_数据库系统组成,继续理解必备知识点:数据库存储_逻辑结构 快速理解 数据存储结构:数据库系统_数据库_表 1. 理解什么是数据库 数据库发展:大致由 人工管理.文件系统.数据库系统(高 ...
- Γ(a) 的两种方差与均值
所以 这里是满足 Be(x+1,n-x+1),如果是要服从Be(a,b) 相应的后验概率
- Map the Debris 轨道周期
返回一个数组,其内容是把原数组中对应元素的平均海拔转换成其对应的轨道周期. 原数组中会包含格式化的对象内容,像这样 {name: 'name', avgAlt: avgAlt}. 至于轨道周期怎么求, ...