pip3 install scrap报错
mac系统 pip3 install scrapy 失败 No local packages or working download links found for incremental>=16.10.1
使用pip3 install scrapy命令之后,会出现如下问题:
Collecting scrapy
Downloading Scrapy-1.4.0-py2.py3-none-any.whl (248kB)
100% |████████████████████████████████| 256kB 1.2MB/s
Collecting PyDispatcher>=2.0.5 (from scrapy)
Downloading PyDispatcher-2.0.5.tar.gz
Collecting Twisted>=13.1.0 (from scrapy)
Downloading Twisted-17.9.0.tar.bz2 (3.0MB)
100% |████████████████████████████████| 3.0MB 323kB/s
Complete output from command python setup.py egg_info:
Download error on https://pypi.python.org/simple/incremental/: [SSL: CERTIFICATE_VERIFY_FAILED] certificate verify failed (_ssl.c:777) -- Some packages may not be found!
Couldn't find index page for 'incremental' (maybe misspelled?)
Download error on https://pypi.python.org/simple/: [SSL: CERTIFICATE_VERIFY_FAILED] certificate verify failed (_ssl.c:777) -- Some packages may not be found!
No local packages or working download links found for incremental>=16.10.1
Traceback (most recent call last):
File "<string>", line 1, in <module>
File "/private/var/folders/z5/9myf58gd0q5cj6hh8pnsfm800000gn/T/pip-build-do6a4sxu/Twisted/setup.py", line 21, in <module>
setuptools.setup(**_setup["getSetupArgs"]())
File "/Library/Frameworks/Python.framework/Versions/3.6/lib/python3.6/distutils/core.py", line 108, in setup
_setup_distribution = dist = klass(attrs)
File "/Library/Frameworks/Python.framework/Versions/3.6/lib/python3.6/site-packages/setuptools/dist.py", line 315, in __init__
self.fetch_build_eggs(attrs['setup_requires'])
File "/Library/Frameworks/Python.framework/Versions/3.6/lib/python3.6/site-packages/setuptools/dist.py", line 361, in fetch_build_eggs
replace_conflicting=True,
File "/Library/Frameworks/Python.framework/Versions/3.6/lib/python3.6/site-packages/pkg_resources/__init__.py", line 850, in resolve
dist = best[req.key] = env.best_match(req, ws, installer)
File "/Library/Frameworks/Python.framework/Versions/3.6/lib/python3.6/site-packages/pkg_resources/__init__.py", line 1122, in best_match
return self.obtain(req, installer)
File "/Library/Frameworks/Python.framework/Versions/3.6/lib/python3.6/site-packages/pkg_resources/__init__.py", line 1134, in obtain
return installer(requirement)
File "/Library/Frameworks/Python.framework/Versions/3.6/lib/python3.6/site-packages/setuptools/dist.py", line 429, in fetch_build_egg
return cmd.easy_install(req)
File "/Library/Frameworks/Python.framework/Versions/3.6/lib/python3.6/site-packages/setuptools/command/easy_install.py", line 659, in easy_install
raise DistutilsError(msg)
distutils.errors.DistutilsError: Could not find suitable distribution for Requirement.parse('incremental>=16.10.1')
----------------------------------------
Command "python setup.py egg_info" failed with error code 1 in /private/var/folders/z5/9myf58gd0q5cj6hh8pnsfm800000gn/T/pip-build-do6a4sxu/Twisted/
解决方案:
$ wget http://curl.haxx.se/ca/cacert.pem
$ mv cacert.pem ca-bundle.crt
$ sudo cp ca-bundle.crt /etc/pki/tls/certs/
注意:在/etc 下,可能并没有/pki/tls/certs/等目录,此时需要手动创建
cd /etc
sudo mkdir pki
cd pki
sudo mkdir tls
cd tls
sudo mkdir certs
返回含有ca-bundle.crt文件的目录,重新执行 $ sudo cp ca-bundle.crt /etc/pki/tls/certs/
然后执行 命令 pip3 install scrapy
安装完成
pip3 install scrap报错的更多相关文章
- Mac中 pip3 install mysqlclient 报错
主要错误提示如下: ld: library not found for -lssl clang: error: linker command failed with exit code 1 (use ...
- pip3 install mysqlclient 报错 “/bin/sh: 1: mysql_config: not found”的解决方法
执行 sudo apt-get install libmysqlclient-dev, 然后执行 pip3 install mysqlclient 成功.
- Ubuntu 18.04 + pip3 install virtualenvwrapper 报错 ERROR: virtualenvwrapper could not find virtualenv in your path
接上片... 问题 virtualenvwrapper装好后, 发现使用mkvirtualenv XX时, 又找不到virtualenv了... apt install python3-virtual ...
- mac brew install redis 报错
mac brew install redis 报错 /usr/local/opt/php55/bin/phpize /usr/local/opt/php55/bin/phpize: line 61: ...
- npm install 安装报错:npm ERR! EPERM npm ERR! -4048 npm ERR! Error: EPERM: operation not permitted, unlink 'D:\test\demo\code\materialT\node_modules\.staging'
更新项目依赖包,删除掉package-lock.json.node_modules,运行npm install,报如上错误信息,查询资料说是没有权限,本人用管理员身份打开powershell,运行np ...
- Win10 pip install gensim 报错处理
# 故障描述 shell > pip install gensim # 报错信息如下: Command "c:\users\op\appdata\local\programs\pyth ...
- python抠图与pip install PIL报错
窗口命令pip install PIL(python3.6+selenium——2.53.1+pycharm) from PIL import Image from selenium import w ...
- pip install python-igraph 报错,C core of igraph 没有安装。
(一)问题描述 Centos7 安装python-igraph时,pip install python-igraph 报错,C core of igraph 没有安装. failure: repoda ...
- thinkphp6安装报错,composer install tp6 报错 Parse error: syntax error
composer install thinkphp6 报错 Parse error: syntax error, unexpected ':', expecting '{' in vendor\top ...
随机推荐
- 在用mybatis向MySQL数据库中插入时间时报错:Incorrect datetime value: '' for column '' at row 1
问题说明:使用的MySQL是5.1.37版本,用的mysql-connector-java-5.0.4.jar版本,在java文件中定义的字段是Date类型,MySQL中定义的字段类型是datetim ...
- python2.x 与 python3.x的区别
从语言的源码角度: python2.x 的源码书写不够规范,且源码有重复,代码的复用率不高; python3.x 的源码清晰.优美.简单 从语言的特性角度: python2.x 默认为ASCII字符编 ...
- day1-python简介+安装
Python 简介 Python 是一个高层次的结合了解释性.编译性.互动性和面向对象的脚本语言. Python 的设计具有很强的可读性,相比其他语言经常使用英文关键字,其他语言的一些标点符号,它具有 ...
- (C/C++学习笔记) 一. 基础知识
一. 基础知识 ● 程序和C/C++ 程序: 根据Wirth (1976), Algorithms + Data Structures = Programs. Whence C: 1972, Denn ...
- :代理模式:proxy
#ifndef __PROXY_H__ #define __PROXY_H__ class Subject { public: Subject(){} virtual ~Subject(){} vir ...
- windows剪贴板
0x01 Windows剪贴板 Windows剪贴板是一种比较简单同时也是开销比较小的IPC(InterProcess Communication,进程间通讯)机制.Windows系统支持剪贴板IP ...
- DevExpress WinForms v18.2新版亮点(二)
行业领先的.NET界面控件2018年第二次重大更新——DevExpress v18.2日前正式发布,本站将以连载的形式为大家介绍各版本新增内容.本文将介绍了DevExpress WinForms v1 ...
- Oracle 用户 表 表空间之间的关系和管理
文献地址: https://blog.csdn.net/jmilk/article/details/51599260 https://www.cnblogs.com/roger112/p/768530 ...
- scrapy--分布式爬虫
14.3 使用scrapy-redis进行分布式爬取了解了scrapy-redis的原理后,我们学习使用scrapy + scrapyredis进行分布式爬取.14.3.1 搭建环境首先搭建scrap ...
- JFrame,JPanel,JLabel详解
JFrame是一个顶层的框架类,好比一个窗户的框子.也是一个容器类.这个框子可以嵌入几个玻璃窗. JPanel是一个容器类,相当于一大玻璃窗. JLabel等是一些基础组件,它必须置于某个容器里,类似 ...