caffe: fuck compile error again : error: a value of type "const float *" cannot be used to initialize an entity of type "float *"
wangxiao@wangxiao-GTX980:~/Downloads/caffe-master$ make -j8
find: `wangxiao/bvlc_alexnet/spl': No such file or directory
find: `caffemodel': No such file or directory
find: `wangxiao/bvlc_alexnet/0.77': No such file or directory
find: `caffemodel': No such file or directory
NVCC src/caffe/layers/euclidean_loss_layer.cu
src/caffe/layers/euclidean_loss_layer.cu(41): error: a value of type "const float *" cannot be used to initialize an entity of type "float *"
detected during instantiation of "void caffe::EuclideanLossLayer<Dtype>::Backward_gpu(const std::vector<caffe::Blob<Dtype> *, std::allocator<caffe::Blob<Dtype> *>> &, const std::vector<__nv_bool, std::allocator<__nv_bool>> &, const std::vector<caffe::Blob<Dtype> *, std::allocator<caffe::Blob<Dtype> *>> &) [with Dtype=float]"
(140): here
src/caffe/layers/euclidean_loss_layer.cu(42): error: a value of type "const float *" cannot be used to initialize an entity of type "float *"
detected during instantiation of "void caffe::EuclideanLossLayer<Dtype>::Backward_gpu(const std::vector<caffe::Blob<Dtype> *, std::allocator<caffe::Blob<Dtype> *>> &, const std::vector<__nv_bool, std::allocator<__nv_bool>> &, const std::vector<caffe::Blob<Dtype> *, std::allocator<caffe::Blob<Dtype> *>> &) [with Dtype=float]"
(140): here
src/caffe/layers/euclidean_loss_layer.cu(41): error: a value of type "const double *" cannot be used to initialize an entity of type "double *"
detected during instantiation of "void caffe::EuclideanLossLayer<Dtype>::Backward_gpu(const std::vector<caffe::Blob<Dtype> *, std::allocator<caffe::Blob<Dtype> *>> &, const std::vector<__nv_bool, std::allocator<__nv_bool>> &, const std::vector<caffe::Blob<Dtype> *, std::allocator<caffe::Blob<Dtype> *>> &) [with Dtype=double]"
(140): here
src/caffe/layers/euclidean_loss_layer.cu(42): error: a value of type "const double *" cannot be used to initialize an entity of type "double *"
detected during instantiation of "void caffe::EuclideanLossLayer<Dtype>::Backward_gpu(const std::vector<caffe::Blob<Dtype> *, std::allocator<caffe::Blob<Dtype> *>> &, const std::vector<__nv_bool, std::allocator<__nv_bool>> &, const std::vector<caffe::Blob<Dtype> *, std::allocator<caffe::Blob<Dtype> *>> &) [with Dtype=double]"
(140): here
4 errors detected in the compilation of "/tmp/tmpxft_000007e5_00000000-16_euclidean_loss_layer.compute_50.cpp1.ii".
make: *** [.build_debug/cuda/src/caffe/layers/euclidean_loss_layer.o] Error 1
wangxiao@wangxiao-GTX980:~/Downloads/caffe-master$
----------------------------------------------------------------------
----------------------------------------------------------------------
原因分析:
主要是因为,在欧式距离损失函数中,我增添了以下两句话:
Dtype* diff_cpu_data = bottom[i]->mutable_cpu_diff();
Dtype* label_data = bottom[1]->cpu_data(); // label data: 0 or 1
Dtype* predict_data = bottom[0]->cpu_data(); // predict data
再来看看提示的错误:
src/caffe/layers/euclidean_loss_layer.cu(41): error: a value of type "const float *" cannot be used to initialize an entity of type "float *"
detected during instantiation of "void
caffe::EuclideanLossLayer<Dtype>::Backward_gpu(const
std::vector<caffe::Blob<Dtype> *,
std::allocator<caffe::Blob<Dtype> *>> &, const
std::vector<__nv_bool, std::allocator<__nv_bool>> &,
const std::vector<caffe::Blob<Dtype> *,
std::allocator<caffe::Blob<Dtype> *>> &) [with
Dtype=float]"
(140): here
src/caffe/layers/euclidean_loss_layer.cu(42): error: a value of type "const float *" cannot be used to initialize an entity of type "float *"
detected during instantiation of "void
caffe::EuclideanLossLayer<Dtype>::Backward_gpu(const
std::vector<caffe::Blob<Dtype> *,
std::allocator<caffe::Blob<Dtype> *>> &, const
std::vector<__nv_bool, std::allocator<__nv_bool>> &,
const std::vector<caffe::Blob<Dtype> *,
std::allocator<caffe::Blob<Dtype> *>> &) [with
Dtype=float]"
(140): here
肯定是少了 const 约束:
so , 改为:
const Dtype* label_data = bottom[1]->cpu_data(); // label data: 0 or 1
const Dtype* predict_data = bottom[0]->cpu_data(); // predict data
在编译,就ok啦 ~~
2. 问题2:
CXX src/caffe/layers/accuracy_layer.cpp
src/caffe/layers/accuracy_layer.cpp: In instantiation of ‘void caffe::AccuracyLayer<Dtype>::Forward_cpu(const std::vector<caffe::Blob<Dtype>*>&, const std::vector<caffe::Blob<Dtype>*>&) [with Dtype = float]’:
src/caffe/layers/accuracy_layer.cpp:286:1: required from here
src/caffe/layers/accuracy_layer.cpp:98:21: error: assignment of read-only location ‘*(bottom_data + 84u)’
bottom_data[21] = 1; bottom_data[22] = 0; bottom_data[23] = 0; bottom_data[24] = 0;
看到错误就应该知道:错误的原因是给只读的变量赋值了。。。
但是,又想改变那个值,来作为最后求解的结果,怎么办呢? 好吧,那就只好先将该变量存到一个中间变量里面去了,但是,问题又来了,原本const 的变量可以赋值给普通的变量么?
例如: float a = const float b ? 这样ok么?我觉得不ok,先试试吧。。。
caffe: fuck compile error again : error: a value of type "const float *" cannot be used to initialize an entity of type "float *"的更多相关文章
- ubuntu下安装pandas出现 compile failed with error code 1 in /tmp/pip_build_hadoop/pandas
都是用pip装的,是不是应该用apt-get 装的呀 ubuntu下安装pandas (出现 compile failed with error code 1 in /tmp/pip_build_ha ...
- Inceptor [Code: 40000, SQL State: 42000] COMPILE FAILED: Internal error NullPointerException: [Error 40000] java.lang.NullPointerException
下面代码报空指针 with `__all_dim__` as ( select * from ( select from_unixtime(unix_timestamp(`__bts__`) -1,' ...
- fatal error C1189: #error : core.hpp header must be compiled as C++
两次opencv工程需要设置为C++编译:找了一半天的解决方法. I am building a C application that uses OpenCV. when compiling, I g ...
- AndroidStudio与eclipse打包的时候报错。Error:(4) Error: "ssdk_instapager_login_html" is not translated in "en"
作者:程序员小冰,CSDN博客:http://blog.csdn.net/qq_21376985 QQ986945193 博客园主页:http://www.cnblogs.com/mcxiaobing ...
- sqoop:Failed to download file from http://hdp01:8080/resources//oracle-jdbc-driver.jar due to HTTP error: HTTP Error 404: Not Found
环境:ambari2.3,centos7,sqoop1.4.6 问题描述:通过ambari安装了sqoop,又添加了oracle驱动配置,如下: 保存配置后,重启sqoop报错:http://hdp0 ...
- MDK st-link下载STM32程序出现Internal command error和Error:Flash download failed. Target DLL
MDK st-link下载STM32程序出现Internal command error和Error:Flash download failed. Target DLL 是因为目标板的芯片处于休眠 ...
- Android Studio Error:CreateProcess error=216
Error:CreateProcess error=216, This version of %1 is not compatible with the version of Windows you' ...
- mysql [ERROR] Fatal error: Can't open and lock privilege tables: Table 'mysql.host' doesn't exist (转载)
mysql报错Fatal error: Can't open and lock privilege tables: Table 'mysql.host' doesn't exist 2013-11-2 ...
- [ERROR] Fatal error: Can't open and lock privilege tables: Table 'mysql.host' doesn't exist
mysql 启动总是报错: 错误日志中显示: [ERROR] Fatal error: Can't open and lock privilege tables: Table 'mysql.host' ...
随机推荐
- javascript中创建对象的几种方式
1. 使用Object构造函数来创建一个对象,下面代码创建了一个person对象,并用两种方式打印出了Name的值. var person = new Object(); person.name=&q ...
- SVG 2D入门1 - SVG综述
位图与矢量图 以前,浏览器中显示的图形,例如jpeg.gif等,都是位图,这些图像格式是基于光栅的.在光栅图像中,图像文件定义了图像中每个像素的颜色值.浏览器需要读取这些值并做出相应行动.这种图像的再 ...
- ERP员工入登记查询(六)
实现的功能:
- SWUST0249 (凸包面积)
type node=record x,y:longint; end; ; var k,q,qq:longint; sum:double; f,g:..maxn] of node; m,i,j,a,b: ...
- Unity3d各平台资源路径文件夹
之前一直是PC项目,公司终于考虑移动平台了,但是试验了几把,感觉移动平台资源管理路径还是有很多隐藏的注意事项. 比如在PC上可以做到随便读写,但是在移动平台就涉及到权限问题. 看到小伙伴的总结,还是要 ...
- magento使用google analytics
magento与google的很多功能是无缝集成的,这个展现了magento在seo方面的强大. 用了magento就不用傻到在页面里添加google analytic的跟踪代码了,激活google ...
- magento做手机端思路
有个插件可以检测移动设备访问,然后显示对于的手机主题这个方法最简单另外的就是调接口了这个用来做app也行不过mg的数据不是json数据,是xml速度很慢
- socket() failed (13: Permission denied) while connecting to upstream
/*************************************************************************** * socket() failed (13: ...
- mybatis和model关联
<select id="getSubCreditLogBySubCreditId" parameterType="long" resultType=&qu ...
- linux 命令chmod 和chown
chmod 命令 “chmod”命令就是改变文件的模式位.chmod会根据要求的模式来改变每个所给的文件,文件夹,脚本等等的文件模式(权限). 在文件(文件夹或者其它,为了简单起见,我们就使用文件)中 ...