npm install node-sass失败
Cannot download "https://github.com/sass/node-sass/releases/download/v3.8.0/win32-x64-46_binding.node":
这句话大家都懂的哈,我就不说了,这里我也不知道为什么会下载失败,因为我的电脑全局代理的,正常的访问任何网站都是无阻碍的,百思不得解,
好吧那我就自己下载吧(为什么自己下载?因为我在google的时候也是发现了写有用的东西,虽然没那么直观哈,但是也给了我很多帮助)
下载完了之后把它注册成全局环境变量,两种方式:
第一种:直接右键我的电脑--》属性--》高级系统设置--》环境变量--》添加 - SASS_BINARY_PATH
第二种:set XXX=文件路经--》set SASS_BINARY_PATH=F:\lishiming\tools\node-sass\win32-x64-46_binding.node
查看环境是否合适:echo %SASS_BINARY_PATH%
如果打印出来您配置好的文件地址那就ok了,
最后再来试试安装:npm i -g node-sass
参照上面的答案完美解决
npm install node-sass失败的更多相关文章
- 解决 $ npm install node-sass --save-dev 失败的问题
$ npm install --save node-sass --registry=https://registry.npm.taobao.org --disturl=https://npm.taob ...
- angular2使用官网npm install下载依赖失败的处理方法
上一两个月在学习angular2,在下载依赖阶段看官网是直接自动下载的,[npm install] 就能把依赖全部弄下来.不过作为新手的我,是倒腾来倒腾去都倒不出来,因为老是报同一个错.官网也还有手动 ...
- vue 使用npm install安装依赖失败 【问题分析与解决】
1 进入项目根目录,先通过 npm install 命令安装项目所需依赖,再通过 vue ui 命令打开 Vue Cli 提供的图形化界面,选择项目所在文件夹将项目导入. 出现问题 npm insta ...
- How to install Node.js on Linux
How to install Node.js on Linux Posted on November 13, 2015 by Dan Nanni Leave a comment Question: H ...
- npm常用命令学习(npm install -D,semver版本规范, npm进行版本管理的最佳实践用法)
什么是npm npm有两层含义.一层含义是Node的开放式模块登记和管理系统,网址为npmjs.org.另一层含义是Node默认的模块管理器,是一个命令行下的软件,用来安装和管理Node模块. npm ...
- npm install 失败
总结列表: 1. There is already an open DataReader associated with this Connection which must be closed fi ...
- npm run dev运行Vue项目报错:Node Sass does not yet support your current environment
导入Vue项目后,#npm run dev 报错: error in ./src/pages/hello.vue Module build failed: Error: Node Sass does ...
- npm install 错误 安装 chromedriver 失败的解决办法
npm 安装 chromedriver 失败的解决办法npm 安装 chromedriver 时,偶尔会出错,错误提示类似于:npm ERR! chromedriver@2.35.0 install: ...
- VUE npm run dev 启动时,报了一大堆错误 Node Sass could not find a binding for your current environment: Windows 64-bit with Node.js 7.x
npm run dev 启动时,报了一大堆错误 Module build failed: Error: Missing binding E:\2017VocaSchool\vocationWeb\no ...
- 输入npm install 报错npm ERR! code ELIFECYCLE npm ERR! errno 1 npm ERR! node-sass@4.13.1 postinstall: `node scripts/build.js`
输入npm install 报以下错误 npm ERR! code ELIFECYCLE npm ERR! errno 1 npm ERR! node-sass@4.13.1 postinstall: ...
随机推荐
- python+selenium+Jenkins构建自动化测试
环境准备 本次使用JDK:1.8.tomcat:8.5.Jenkins:2.127 安装jdk 官方下载地址 安装教程参考 安装tomcat 和jenkins tomcat官方下载地址 jenkins ...
- 获取修改value
val() 方法,获取和修改有value属性的元素,有value属性的元素有input.botton.select等.相当于JavaScript中的value. <!DOCTYPE html&g ...
- RabbitMQ(一):RabbitMQ 安装与配置(Mac)
一.rabbitmq 安装与配置 安装: brew install rabbitmq # 进入安装目录 cd /usr/local/Cellar/rabbitmq/3.7.12 # 启动 brew s ...
- java 使用反射在dto和entity 实体类之间进行转换
package com.example.demo.utils; import java.lang.reflect.Method; import java.util.List; import com.e ...
- usaco 校园网
题解: 显然当一个图上的点是一个环时能满足题目要求 那么我们来考虑怎么形成一个环 很显然的是要先缩点 缩完点就成为了森林,如何让森林成环呢? 考虑一下环上的点的入度出度一定都大于1 而连一条边可以增加 ...
- [ZJOI2006]书架
链接:https://www.luogu.org/problemnew/show/P2596 题解: 写了两天的平衡树终于大概弄好了所有模板(模板不熟写错debug真是要死) 对于放在头尾,只需要删除 ...
- asp.net core 微信H5支付(扫码支付,H5支付,公众号支付,app支付)之2
上一篇说到微信扫码支付,今天来分享下微信H5支付,适用场景为手机端非微信浏览器调用微信H5支付惊醒网站支付业务处理.申请开通微信H5支付工作不多做介绍,直接上代码. 首先是微信支付业务类(WxPayS ...
- 【Java】 剑指offer(29) 顺时针打印矩阵
本文参考自<剑指offer>一书,代码采用Java语言. 更多:<剑指Offer>Java实现合集 题目 输入一个矩阵,按照从外向里以顺时针的顺序依次打印出每一个数字. 思 ...
- 利用IntelliJ IDEA 创建第一个项目
1.创建项目 打开后点击第一个按钮
- spring security 获取当前用户信息
1.从页面上显示当前登陆的用户名 sec:authentication="name" <html xmlns:th="http://www.thymeleaf.or ...