这个是需要证书导致无法连接,临时解决办法是设置 npm set strict-ssl=false

在 Dockerfile文件里的  RUN npm install 之前添加 RUN npm set strict-ssl=false

FROM node:12

# Create app directory
WORKDIR /usr/src/app # Install app dependencies
# A wildcard is used to ensure both package.json AND package-lock.json are copied
# where available (npm@5+)
COPY package*.json ./ RUN npm set strict-ssl=false RUN npm install
# If you are building your code for production
# RUN npm ci --only=production # Bundle app source
COPY . . EXPOSE 8080 CMD [ "node", "server.js" ]

  

连接:

把一个 Node.js web 应用程序给 Docker 化 :https://nodejs.org/zh-cn/docs/guides/nodejs-docker-webapp/

Docker npm install:npm ERR! code UNABLE_TO_GET_ISSUER_CERT_LOCALLY 。。reason: unable to get local issuer certificate 解决办法的更多相关文章

  1. npm install的时候出现unexpected end of file错误提示时的解决办法

    运行npm cache clean --force 清空npm缓存即可决这个问题 参考:https://blog.csdn.net/jingtian678/article/details/811876 ...

  2. CocoaPods pod install的时候报错:invalid byte sequence in UTF-8 (ArgumentError)解决办法

    CocoaPods pod install的时候报错:invalid byte sequence in UTF-8 (ArgumentError)解决办法: 基本可以确定是Podfile中的内容编码有 ...

  3. github上拉去代码执行 npm install报错code:128

    npm ERR! code npm ERR! Command failed: D:\Program Files\Git\cmd\git.EXE clone --mirror -q git://gith ...

  4. npm install, npm install -g, npm install --save, npm install --save-dev之间的区别

    1.npm install X 安装X到项目的node_modules文件夹 会修改package.json,在dependencies中写入依赖.(关于这一点,网上的大部分文章都是说,不会修改pac ...

  5. 关于npm安装全局模块,require时报Error: Cannot find module 'XXX'的解决办法

    系统环境:centos 下午使用npm安装"cheerio",想搞爬虫玩玩. npm安装有两种模式: 本地 # npm install cheerio 全局 # npm insta ...

  6. npm 启动项目报错 Cannot find module '\@babel\compat-data\data\corejs3-shipped-proposals',解决办法

    最近升级了系统的node ,webpack 等等,然后今天打开项目,突然启动不起来了~~ 报错信息如下: Module build failed (from ./node_modules/babel- ...

  7. iOS: 删除真机测试的Provisioning Profile后,在Code Singing中出现entitlements.plist文件无效,解决办法如下:

    问题主题:method to The entitlements specified in your application’s Code Signing Entitlements file do no ...

  8. mysql数据库导入sql文件时提示“Error Code: 1153 - Got a packet bigger than 'max_allowed_packet' bytes”解决办法

    向mysql数据库中导入sql文件时,如果文件过大(几百M),会提示"Error Code: 1153 - Got a packet bigger than 'max_allowed_pac ...

  9. 关于出现Specified VM install not found: type Standard VM, name jdk1.5.0_04问题的解决办法

    问题出现背景: 今天把原来电脑中的jdk版本由1.7换到了1.8,,重新在Eclipse中配置环境后出现了此问题 问题解决办法: 在你的项目中,选中ant文件,右键>>Run As > ...

  10. VS Code使用.vue的v-for方法提示错误的解决办法

    1.在使用v-for的时候在后面跟上:key="key" <div v-for="(value, key) in [1,2,3]" :key=" ...

随机推荐

  1. react hooks + ts 封装组件

    react hooks+ts组件封装 简介 在react使用ts封装组件,需要注意类型, 使用 forwardRef 方法包起来 子组件 import * as React from "re ...

  2. vagrant 环境安装(前置篇)

    ubuntu可以直接 apt 源查找 sudo apt search vagrant 直接就 sudo apt-get install vagrant 如果版本不是 2.2.6 可以去 https:/ ...

  3. Linux中vim快捷键+vim报错解决

    vim快捷键+vim报错解决 vim 快捷键 编辑器 ​ yum -y install vim ​ 快捷键: 视图模式: 0 Home ^ 快速移动光标到行首 $ End 快速移动光标到行尾 u 撤销 ...

  4. apache做负载均衡器 配置

    将Apache作为LoadBalance前置机分别有三种不同的部署方式,分别是: 1 )轮询均衡策略的配置 进入Apache的conf目录,打开httpd.conf文件,在文件的末尾加入: Proxy ...

  5. 解决window.close()在谷歌浏览器不起作用

    简单明了直接上解决方法: let url = ' '; // 空字符串中间要加空格 window.open(url, '_self').close();

  6. Mybatis【16】-- Mybatis多对一关联查询

    注:代码已托管在GitHub上,地址是:https://github.com/Damaer/Mybatis-Learning ,项目是mybatis-12-many2one,需要自取,需要配置mave ...

  7. windows 上部署 kafka 做测试

    1.下载 需要下载 zookeeper 和kafka 我下载的版本是 2.部署 2.1 部署 zookeeper 2.1.1 新建配置文件 zoo.cfg 内容为 tickTime = 2000 da ...

  8. 德承工控机DA-1000 RS-485串口设置

    由于一般情况下调试串口常使用RS-485转USB接口来进行调试,但是USB接口在长时间的调试下,接口容易松动,通讯也比较不稳定容易中断,所以改为DB9接口的RS-485来调试,稳固不松脱.抗干扰能力强 ...

  9. AD使用插件生成交互式BOM

    AD使用插件生成交互式BOM 效果图镇楼: 下面来说一下怎么搞,过程其实也很简单,就加载一个脚本的事儿. 1.下载AD用交互式BOM插件 首先前往GitHub下载这位大佬开发的插件 地址:https: ...

  10. Qt+OPC开发笔记(一):OPCUA介绍、open62541介绍、编译与基础环境Demo

    前言   本篇介绍OPC协议,相关开源库.编译并搭建Qt开发OPC的基础环境.   Demo      OPC   OPC(OLE for Process Control)是一个工业标准,用于实现工业 ...