新建maven工程运行出现Intellij idea 报错:Error : java 不支持发行版本5
Step1点击:


点击
保持一致:
Step2点击


这样就可以了。
主要是运行时jdk版本不一致的问题
新建maven工程运行出现Intellij idea 报错:Error : java 不支持发行版本5的更多相关文章
- 运行连接Oracle数据库时,Idea报错: Error : java 不支持发行版本5
按照上面的截图步骤,一步步往下走,再运行程序时就不会报错了. 原文链接:https://blog.csdn.net/qq_22076345/article/details/82392236 感谢原文作 ...
- Intellij idea 报错:Error : java 不支持发行版本5
保证下面几个地方编译版本一致: 分两步: 第一步,进入Project Structure中设置Project JDK 以及Project Level ,高于JDK5版本 第二步,进入设置中将项目的JD ...
- 导入Maven 工程pom.xml首行报错解决方法
1.利用IDE导入一个Maven工程,但是pom.xml文件首行报错,发现是maven版本需要升级 2.在pom.xml文件 增加配置 <properties> <maven-jar ...
- maven命令行创建web项目报错:java.lang.NoClassDefFoundError: org/apache/commons/lang/StringUtils
早上一上班就想新建一个web项目玩玩,没想到一敲命令创建就失败了,真是出师不利.各种折腾无果,当然我也可以用eclipse直接创建的,就是不甘心被这破问题给耍了.刚刚才发现问题原因,这个结果我也是醉了 ...
- IDEA编译报错Error:java: Compilation failed: internal java compiler error
根据报错可以知道是编译某个模块报错, 接下来就是检查这个模块的编译版本 解决办法很简单:File-->Setting...-->Build,Execution,Deployment--&g ...
- Idea启动报错 Error:java: System Java Compiler was not found in classpath
报错信息:Error:java: System Java Compiler was not found in classpath 使用IDEA启动的时候出现了这个错误,查找了很久,才找到解决办法 1. ...
- IDEA运行报错 Error:java: 错误: 不支持发行版本 xx
解决方案 修改项目配置,进入Project Setting,截图可参考下面的截图 1.修改全局设置 修改Project->Project Language Level->选择版本比当前jd ...
- 运行开源项目,报错Error:(48, 37) 错误: -source 1.6 中不支持 diamond 运算符,请使用-source 7或者更高版本已启用diamond运算符
错误定位 当时并没有弄明白为什么会出错,一脸懵逼相 解决办法: 将source compatibility和target compatibility都改为1.7,重新build就ok了. 错误原因: ...
- AS项目报错 Error:java.util.concurrent.ExecutionException: com.android.tools.aapt2.Aapt2Exception: AAPT2 error: check logs for details
1 修改gradle的缓存目录 这个可以通过android studio的设置中找到gradle,配置另一个非中文目录来缓存. File -> Settings -> Build, Exe ...
随机推荐
- Echarts使用一个图例legend实现全选和全部取消的功能
1.修改legend的data值,在前面加上全选和全不选,data = ['全选','全不选',1,2,3] 2.监听 legendselectchanged事件 / 使用刚指定的配置项和数据显示图表 ...
- IntelliJ IDEA 2017.3百度-----树状结构
------------恢复内容开始------------ ------------恢复内容结束------------
- cmd命令和快捷键
命令 含义 盘名: 从C盘到其他盘时输入 dir 查看当前文件夹下的内容 cd 目录名称 选择目录 cd.. 退回当前目录的上一级目录 cd\ 回到根目录 md 目录名称 创建目录 rd 目录名称 删 ...
- npm解决node-sass安装失败
npm装包一直都很成功,直到我遇见了node-sass这个包 我一直报这样的错误 npm ERR! code ELIFECYCLE npm ERR! errno 1 npm ERR! node-sas ...
- jvm(4):类文件结构
typora-root-url: ./ 类文件结构 魔数Magic Number 每个Class文件的头4个字节是魔数.值为0xCAFEBABE 唯一作用:确定这个文件是一个能被虚拟机接受的Class ...
- mp
问题 G: Green Bin 时间限制: 1 Sec 内存限制: 128 MB[提交] [状态] 题目描述 We will call a string obtained by arranging ...
- Win10 系统运行VsCode出现白屏的问题(亲测有效)
Win10 系统运行VsCode出现白屏的问题(亲测有效) 新买的本本,昨天VScode运行还正常,今天打开一直白屏,什么都没有,只有几个小格格,也不是卡死的那种,可以轻松关闭, 刚开始以为版本问题, ...
- MAKEFILE_LIST/CURDIR/MAKECMDGOALS/MAKEOVERRIDES/MAKEFLAGS
http://blog.chinaunix.net/uid-29460203-id-4191975.html https://www.xuebuyuan.com/1148403.html?mobile ...
- JarvisOJ - Writeup(5.31更新)
此篇用来记录我在jarivsOJ上的一些题解,只给解题思路,不放flag Misc 0x01 You Need Python(300) 题目有两个文件,一个py文件,另一个是经过编码的key 文件ke ...
- 解析python 生产/消费者模型实现过程
1.多线程实现 import threadingimport queueimport logginglogging.basicConfig(level = logging.INFO,format = ...